spring-projects/spring-integration master branch

Build: #1727 failed

Job: Default Job failed

Stages & jobs

  1. Default Stage

Job result summary

Completed
Duration
5 minutes
Agent
bamboo-23.af.pivotal.io
Revision
c4ec73f9a0912cf4ba4c77a0ff41de4dc4ec9201 c4ec73f9a0912cf4ba4c77a0ff41de4dc4ec9201
Total tests
3358
Failing since
#1726 (Code changes detected – )
Fixed in
#1728 (Code changes detected)

Tests

  • 3,358 tests in total
  • 2 tests failed
  • 2 failures are new
  • 110 tests were quarantined / skipped
  • 3 minutes taken in total.
New test failures 2
Status Test Duration
Collapse Failed IntegrationGraphControllerTests testIntegrationGraphControllerParser History
< 1 sec
org.springframework.http.converter.HttpMessageNotWritableException: org.springframework.http.converter.HttpMessageNotWritableException: Could not write JSON: (was java.lang.NullPointerException); nested exception is com.fasterxml.jackson.databind.JsonMappingException: (was java.lang.NullPointerException) (through reference chain: org.springframework.integration.graph.Graph["nodes"]->java.util.ArrayList[0]->org.springframework.integration.graph.PollableChannelNode["sendTimers"])
org.springframework.http.converter.HttpMessageNotWritableException: Could not write JSON: (was java.lang.NullPointerException); nested exception is com.fasterxml.jackson.databind.JsonMappingException: (was java.lang.NullPointerException) (through reference chain: org.springframework.integration.graph.Graph["nodes"]->java.util.ArrayList[0]->org.springframework.integration.graph.PollableChannelNode["sendTimers"])
	at org.springframework.http.converter.json.AbstractJackson2HttpMessageConverter.writeInternal(AbstractJackson2HttpMessageConverter.java:296)
	at org.springframework.http.converter.AbstractGenericHttpMessageConverter.write(AbstractGenericHttpMessageConverter.java:104)
	at org.springframework.web.servlet.mvc.method.annotation.AbstractMessageConverterMethodProcessor.writeWithMessageConverters(AbstractMessageConverterMethodProcessor.java:295)
	at org.springframework.web.servlet.mvc.method.annotation.RequestResponseBodyMethodProcessor.handleReturnValue(RequestResponseBodyMethodProcessor.java:181)
	at org.springframework.web.method.support.HandlerMethodReturnValueHandlerComposite.handleReturnValue(HandlerMethodReturnValueHandlerComposite.java:82)
	at org.springframework.web.servlet.mvc.method.annotation.ServletInvocableHandlerMethod.invokeAndHandle(ServletInvocableHandlerMethod.java:124)
(106 more lines...)
Collapse Failed IntegrationGraphControllerTests testIntegrationGraphGet History
< 1 sec
java.lang.AssertionError: java.lang.AssertionError: Status expected:<200> but was:<500>
java.lang.AssertionError: Status expected:<200> but was:<500>
	at org.springframework.test.util.AssertionErrors.fail(AssertionErrors.java:59)
	at org.springframework.test.util.AssertionErrors.assertEquals(AssertionErrors.java:98)
	at org.springframework.test.web.servlet.result.StatusResultMatchers.lambda$matcher$9(StatusResultMatchers.java:627)
	at org.springframework.test.web.servlet.MockMvc$1.andExpect(MockMvc.java:196)
	at org.springframework.integration.http.management.IntegrationGraphControllerTests.testIntegrationGraphGet(IntegrationGraphControllerTests.java:86)
	at sun.reflect.NativeMethodAccessorImpl.invoke0(Native Method)
(74 more lines...)

Error summary

The build generated some errors. See the full build log for more details.

*** java.lang.instrument ASSERTION FAILED ***: "!errorOutstanding" with message transform method call failed at JPLISAgent.c line: 844
*** java.lang.instrument ASSERTION FAILED ***: "!errorOutstanding" with message transform method call failed at JPLISAgent.c line: 844
*** java.lang.instrument ASSERTION FAILED ***: "!errorOutstanding" with message transform method call failed at JPLISAgent.c line: 844
*** java.lang.instrument ASSERTION FAILED ***: "!errorOutstanding" with message transform method call failed at JPLISAgent.c line: 844
javadoc: warning - Multiple sources of package comments found for package "javax.servlet"
javadoc: warning - Multiple sources of package comments found for package "javax.servlet.http"
javadoc: warning - Multiple sources of package comments found for package "javax.servlet.annotation"

218 tests completed, 2 failed, 1 skipped

FAILURE: Build failed with an exception.

* What went wrong:
Execution failed for task ':spring-integration-http:test'.
> There were failing tests. See the report at: file:///opt/bamboo-home/xml-data/build-dir/INT-MASTER-JOB1/spring-integration-http/build/reports/tests/test/index.html

* Try:
Run with --stacktrace option to get the stack trace. Run with --info or --debug option to get more log output. Run with --scan to get full insights.

* Get more help at https://help.gradle.org

BUILD FAILED in 5m 6s