spring-projects/spring-integration master branch

Build: #1730 failed

Job: Default Job failed

Stages & jobs

  1. Default Stage

Job result summary

Completed
Duration
6 minutes
Agent
bamboo-23.af.pivotal.io
Revision
7d949f7f8ae7c3324a0a866c8613bd3d2d5fc667 7d949f7f8ae7c3324a0a866c8613bd3d2d5fc667
Total tests
3852
Fixed in
#1731 (Code changes detected)

Tests

  • 3,852 tests in total
  • 1 test failed
  • 1 failure is new
  • 215 tests were quarantined / skipped
  • 5 minutes taken in total.
New test failures 1
Status Test Duration
Collapse Failed IntegrationGraphServerTests test History
< 1 sec
java.lang.AssertionError: java.lang.AssertionError: 
Expecting:
 <"[{"nodeId":28,"stats":{"loggingEnabled":true,"handleCount":4,"errorCount":0,"meanDuration":0.15899890520500146,"minDuration":0.08427,"maxDuration":0.360255,"standardDeviationDuration":0.10691161102172198,"duration":{"count":4,"min":0.08427,"max":0.360255,"mean":0.15899890520500146,"standardDeviation":0.10691161102172198,"countLong":4},"statsEnabled":true,"countsEnabled":true,"activeCount":0,"deprecated":"stats are deprecated in favor of sendTimers and receiveCounters"},"componentType":"router","properties":{"running":true,"auto-startup":true},"output":"discards","input":"toRouter","sendTimers":{"successes":{"count":4,"mean":0.1669545,"max":0.356683},"failures":{"count":0,"mean":0.0,"max":0.0}},"routes":["barChannel","bazChannel","quxChannel","fizChannel"],"name":"router"}]">
to contain:
 <""stats":{"deprecated"> 
java.lang.AssertionError: 
Expecting:
 <"[{"nodeId":28,"stats":{"loggingEnabled":true,"handleCount":4,"errorCount":0,"meanDuration":0.15899890520500146,"minDuration":0.08427,"maxDuration":0.360255,"standardDeviationDuration":0.10691161102172198,"duration":{"count":4,"min":0.08427,"max":0.360255,"mean":0.15899890520500146,"standardDeviation":0.10691161102172198,"countLong":4},"statsEnabled":true,"countsEnabled":true,"activeCount":0,"deprecated":"stats are deprecated in favor of sendTimers and receiveCounters"},"componentType":"router","properties":{"running":true,"auto-startup":true},"output":"discards","input":"toRouter","sendTimers":{"successes":{"count":4,"mean":0.1669545,"max":0.356683},"failures":{"count":0,"mean":0.0,"max":0.0}},"routes":["barChannel","bazChannel","quxChannel","fizChannel"],"name":"router"}]">
(77 more lines...)

Error summary

The build generated some errors. See the full build log for more details.

*** java.lang.instrument ASSERTION FAILED ***: "!errorOutstanding" with message transform method call failed at JPLISAgent.c line: 844
*** java.lang.instrument ASSERTION FAILED ***: "!errorOutstanding" with message transform method call failed at JPLISAgent.c line: 844
*** java.lang.instrument ASSERTION FAILED ***: "!errorOutstanding" with message transform method call failed at JPLISAgent.c line: 844
javadoc: warning - Multiple sources of package comments found for package "javax.servlet"
javadoc: warning - Multiple sources of package comments found for package "javax.servlet.http"
javadoc: warning - Multiple sources of package comments found for package "javax.servlet.annotation"

2192 tests completed, 1 failed, 47 skipped

FAILURE: Build failed with an exception.

* What went wrong:
Execution failed for task ':spring-integration-core:test'.
> There were failing tests. See the report at: file:///opt/bamboo-home/xml-data/build-dir/INT-MASTER-JOB1/spring-integration-core/build/reports/tests/test/index.html

* Try:
Run with --stacktrace option to get the stack trace. Run with --info or --debug option to get more log output. Run with --scan to get full insights.

* Get more help at https://help.gradle.org

BUILD FAILED in 6m 39s