spring-projects/spring-integration master branch

Build: #1748 failed

Job: Default Job failed

Stages & jobs

  1. Default Stage

Job result summary

Completed
Duration
6 minutes
Agent
bamboo-21.af.pivotal.io
Revision
8a4864e03f011ae4beabd172c2c33dfc20cbb1f8 8a4864e03f011ae4beabd172c2c33dfc20cbb1f8
Total tests
4088
Fixed in
#1749 (Code changes detected)
No failed tests found, a possible compilation error occurred.

Tests

  • 4,088 tests in total
  • 242 tests were quarantined / skipped
  • 6 minutes taken in total.

Error summary

The build generated some errors. See the full build log for more details.

*** java.lang.instrument ASSERTION FAILED ***: "!errorOutstanding" with message transform method call failed at JPLISAgent.c line: 844
*** java.lang.instrument ASSERTION FAILED ***: "!errorOutstanding" with message transform method call failed at JPLISAgent.c line: 844
*** java.lang.instrument ASSERTION FAILED ***: "!errorOutstanding" with message transform method call failed at JPLISAgent.c line: 844
javadoc: warning - Multiple sources of package comments found for package "javax.servlet"
javadoc: warning - Multiple sources of package comments found for package "javax.servlet.http"
javadoc: warning - Multiple sources of package comments found for package "javax.servlet.annotation"
[ant:checkstyle] [ERROR] /opt/bamboo-home/xml-data/build-dir/INT-MASTER-JOB1/spring-integration-jpa/src/test/java/org/springframework/integration/jpa/core/HibernateJpaOperationsTests.java:25:8: Unused import - org.springframework.test.context.ContextConfiguration. [UnusedImports]
[ant:checkstyle] [ERROR] /opt/bamboo-home/xml-data/build-dir/INT-MASTER-JOB1/spring-integration-jpa/src/test/java/org/springframework/integration/jpa/core/HibernateJpaOperationsTests.java:26:8: Unused import - org.springframework.test.context.junit4.SpringJUnit4ClassRunner. [UnusedImports]

FAILURE: Build failed with an exception.

* What went wrong:
Execution failed for task ':spring-integration-jpa:checkstyleTest'.
> Checkstyle rule violations were found. See the report at: file:///opt/bamboo-home/xml-data/build-dir/INT-MASTER-JOB1/spring-integration-jpa/build/reports/checkstyle/test.html
  Checkstyle files with violations: 1
  Checkstyle violations by severity: [error:2]


* Try:
Run with --stacktrace option to get the stack trace. Run with --info or --debug option to get more log output. Run with --scan to get full insights.

* Get more help at https://help.gradle.org

BUILD FAILED in 6m 41s