spring-projects/spring-integration master branch

Build: #1770 failed

Job: Default Job failed

Stages & jobs

  1. Default Stage

Job result summary

Completed
Duration
6 minutes
Agent
bamboo-17.af.pivotal.io
Revision
6468ecc530873e0584699959992317e7166b637b 6468ecc530873e0584699959992317e7166b637b
Total tests
4553
Failing since
#1769 (Code changes detected – )
Fixed in
#1772 (Code changes detected)

Tests

  • 4,553 tests in total
  • 1 test failed
  • 1 failure is new
  • 256 tests were quarantined / skipped
  • 8 minutes taken in total.
New test failures 1
Status Test Duration
Collapse Failed RmiOutboundGatewayTests initializationError History
< 1 sec
java.rmi.NoSuchObjectException: java.rmi.NoSuchObjectException: no such object in table
java.rmi.NoSuchObjectException: no such object in table
	at sun.rmi.transport.StreamRemoteCall.exceptionReceivedFromServer(StreamRemoteCall.java:303)
	at sun.rmi.transport.StreamRemoteCall.executeCall(StreamRemoteCall.java:279)
	at sun.rmi.server.UnicastRef.invoke(UnicastRef.java:375)
	at sun.rmi.registry.RegistryImpl_Stub.rebind(RegistryImpl_Stub.java:158)
	at org.springframework.remoting.rmi.RmiServiceExporter.prepare(RmiServiceExporter.java:292)
	at org.springframework.remoting.rmi.RmiServiceExporter.afterPropertiesSet(RmiServiceExporter.java:230)
(132 more lines...)

Error summary

The build generated some errors. See the full build log for more details.

*** java.lang.instrument ASSERTION FAILED ***: "!errorOutstanding" with message transform method call failed at JPLISAgent.c line: 844
*** java.lang.instrument ASSERTION FAILED ***: "!errorOutstanding" with message transform method call failed at JPLISAgent.c line: 844
*** java.lang.instrument ASSERTION FAILED ***: "!errorOutstanding" with message transform method call failed at JPLISAgent.c line: 844
javadoc: warning - Multiple sources of package comments found for package "javax.servlet"
javadoc: warning - Multiple sources of package comments found for package "javax.servlet.http"
javadoc: warning - Multiple sources of package comments found for package "javax.servlet.annotation"

16 tests completed, 1 failed

FAILURE: Build failed with an exception.

* What went wrong:
Execution failed for task ':spring-integration-rmi:test'.
> There were failing tests. See the report at: file:///opt/bamboo-home/xml-data/build-dir/INT-MASTER-JOB1/spring-integration-rmi/build/reports/tests/test/index.html

* Try:
Run with --stacktrace option to get the stack trace. Run with --info or --debug option to get more log output. Run with --scan to get full insights.

* Get more help at https://help.gradle.org

BUILD FAILED in 6m 45s