spring-projects/spring-integration master branch

Build: #1771 failed

Job: Default Job failed

Stages & jobs

  1. Default Stage

Job result summary

Completed
Duration
2 minutes
Agent
bamboo-17.af.pivotal.io
Revision
841a91d2cbbf6f4206a00a19417bae1ca84bebd2 841a91d2cbbf6f4206a00a19417bae1ca84bebd2
Failing since
#1769 (Code changes detected – )
Fixed in
#1772 (Code changes detected)
No failed tests found, a possible compilation error occurred.

Error summary

The build generated some errors. See the full build log for more details.

Could not find test result reports in the /opt/bamboo-home/xml-data/build-dir/INT-MASTER-JOB1 directory.
/opt/bamboo-home/xml-data/build-dir/INT-MASTER-JOB1/spring-integration-amqp/src/main/java/org/springframework/integration/amqp/dsl/AmqpBaseInboundGatewaySpec.java:19: error: package org.springframework.amqp.rabbit.core.support does not exist
import org.springframework.amqp.rabbit.core.support.BatchingStrategy;
                                                   ^
/opt/bamboo-home/xml-data/build-dir/INT-MASTER-JOB1/spring-integration-amqp/src/main/java/org/springframework/integration/amqp/dsl/AmqpBaseInboundGatewaySpec.java:149: error: cannot find symbol
        public S batchingStrategy(BatchingStrategy batchingStrategy) {
                                  ^
  symbol:   class BatchingStrategy
  location: class AmqpBaseInboundGatewaySpec<S>
  where S is a type-variable:
    S extends AmqpBaseInboundGatewaySpec<S> declared in class AmqpBaseInboundGatewaySpec
2 errors

FAILURE: Build failed with an exception.

* What went wrong:
Execution failed for task ':spring-integration-amqp:compileJava'.
> Compilation failed; see the compiler error output for details.

* Try:
Run with --stacktrace option to get the stack trace. Run with --info or --debug option to get more log output. Run with --scan to get full insights.

* Get more help at https://help.gradle.org

BUILD FAILED in 2m 35s