spring-projects/spring-integration master branch

Build: #1775 failed

Job: Default Job failed

Stages & jobs

  1. Default Stage

Job result summary

Completed
Duration
6 minutes
Agent
bamboo-22.af.pivotal.io
Revision
69401c263c33bffae54bc524ca396ef3944fe773 69401c263c33bffae54bc524ca396ef3944fe773
Total tests
3862
Fixed in
#1777 (Code changes detected)

Tests

  • 3,862 tests in total
  • 2 tests failed
  • 2 failures are new
  • 217 tests were quarantined / skipped
  • 6 minutes taken in total.
New test failures 2
Status Test Duration
Collapse Failed MessageChannelReactiveUtilsTest testBackpressureWithSubscribableChannel History
< 1 sec
java.lang.AssertionError: java.lang.AssertionError: request overflow (expected production of at most 10; produced: 11; request overflown by signal: onNext(GenericMessage [payload=foo, headers={id=2f1b4f2b-0580-c341-dfb6-97ac6af909c0, timestamp=1572625104275}]))
java.lang.AssertionError: request overflow (expected production of at most 10; produced: 11; request overflown by signal: onNext(GenericMessage [payload=foo, headers={id=2f1b4f2b-0580-c341-dfb6-97ac6af909c0, timestamp=1572625104275}]))
	at reactor.test.MessageFormatter.assertionError(MessageFormatter.java:115)
	at reactor.test.MessageFormatter.failPrefix(MessageFormatter.java:104)
	at reactor.test.DefaultStepVerifierBuilder$DefaultVerifySubscriber.setFailurePrefix(DefaultStepVerifierBuilder.java:1280)
	at reactor.test.DefaultStepVerifierBuilder$DefaultVerifySubscriber.checkRequestOverflow(DefaultStepVerifierBuilder.java:1328)
	at reactor.test.DefaultStepVerifierBuilder$DefaultVerifySubscriber.onNext(DefaultStepVerifierBuilder.java:1082)
	at reactor.core.publisher.FluxCreate$IgnoreSink.next(FluxCreate.java:618)
(16 more lines...)
Collapse Failed MessageChannelReactiveUtilsTest testOverproducingWithSubscribableChannel History
< 1 sec
java.lang.AssertionError: java.lang.AssertionError: request overflow (expected production of at most 10; produced: 11; request overflown by signal: onNext(GenericMessage [payload=foo, headers={id=0a1b8e42-9f55-21fa-8612-09163fc1bc07, timestamp=1572625104330}]))
java.lang.AssertionError: request overflow (expected production of at most 10; produced: 11; request overflown by signal: onNext(GenericMessage [payload=foo, headers={id=0a1b8e42-9f55-21fa-8612-09163fc1bc07, timestamp=1572625104330}]))
	at reactor.test.MessageFormatter.assertionError(MessageFormatter.java:115)
	at reactor.test.MessageFormatter.failPrefix(MessageFormatter.java:104)
	at reactor.test.DefaultStepVerifierBuilder$DefaultVerifySubscriber.setFailurePrefix(DefaultStepVerifierBuilder.java:1280)
	at reactor.test.DefaultStepVerifierBuilder$DefaultVerifySubscriber.checkRequestOverflow(DefaultStepVerifierBuilder.java:1328)
	at reactor.test.DefaultStepVerifierBuilder$DefaultVerifySubscriber.onNext(DefaultStepVerifierBuilder.java:1082)
	at reactor.core.publisher.FluxCreate$IgnoreSink.next(FluxCreate.java:618)
(16 more lines...)

Error summary

The build generated some errors. See the full build log for more details.

*** java.lang.instrument ASSERTION FAILED ***: "!errorOutstanding" with message transform method call failed at JPLISAgent.c line: 844
*** java.lang.instrument ASSERTION FAILED ***: "!errorOutstanding" with message transform method call failed at JPLISAgent.c line: 844
*** java.lang.instrument ASSERTION FAILED ***: "!errorOutstanding" with message transform method call failed at JPLISAgent.c line: 844
*** java.lang.instrument ASSERTION FAILED ***: "!errorOutstanding" with message transform method call failed at JPLISAgent.c line: 844
javadoc: warning - Multiple sources of package comments found for package "javax.servlet"
javadoc: warning - Multiple sources of package comments found for package "javax.servlet.http"
javadoc: warning - Multiple sources of package comments found for package "javax.servlet.annotation"

2195 tests completed, 2 failed, 48 skipped

FAILURE: Build failed with an exception.

* What went wrong:
Execution failed for task ':spring-integration-core:test'.
> There were failing tests. See the report at: file:///opt/bamboo-home/xml-data/build-dir/INT-MASTER-JOB1/spring-integration-core/build/reports/tests/test/index.html

* Try:
Run with --stacktrace option to get the stack trace. Run with --info or --debug option to get more log output. Run with --scan to get full insights.

* Get more help at https://help.gradle.org

BUILD FAILED in 6m 52s