spring-projects/spring-integration master branch

Build: #1776 failed

Job: Default Job failed

Stages & jobs

  1. Default Stage

Job result summary

Completed
Duration
6 minutes
Agent
bamboo-24.af.pivotal.io
Revision
36c9f72a9d3f0521cb74cfa1d0b2dfa8a5ab4e93 36c9f72a9d3f0521cb74cfa1d0b2dfa8a5ab4e93
Total tests
4095
Failing since
#1775 (Code changes detected – )
Fixed in
#1777 (Code changes detected)

Tests

  • 4,095 tests in total
  • 1 test failed
  • 1 failure is new
  • 220 tests were quarantined / skipped
  • 8 minutes taken in total.
New test failures 1
Status Test Duration
Collapse Failed ReactiveStreamsConsumerTests testReactiveStreamsConsumerPollableChannel History
< 1 sec
java.lang.AssertionError: java.lang.AssertionError: 
Expecting:
 <GenericMessage [payload=test, headers={id=057fb2a3-8557-7a91-8091-47d3f5c9543e, timestamp=1572634553168}]>
and actual:
 <GenericMessage [payload=test2, headers={id=16aa91c6-7a90-1312-c641-91a47dfcd201, timestamp=1572634553169}]>
to refer to the same object
java.lang.AssertionError: 
Expecting:
(71 more lines...)

Error summary

The build generated some errors. See the full build log for more details.

*** java.lang.instrument ASSERTION FAILED ***: "!errorOutstanding" with message transform method call failed at JPLISAgent.c line: 844
*** java.lang.instrument ASSERTION FAILED ***: "!errorOutstanding" with message transform method call failed at JPLISAgent.c line: 844
*** java.lang.instrument ASSERTION FAILED ***: "!errorOutstanding" with message transform method call failed at JPLISAgent.c line: 844
*** java.lang.instrument ASSERTION FAILED ***: "!errorOutstanding" with message transform method call failed at JPLISAgent.c line: 844
javadoc: warning - Multiple sources of package comments found for package "javax.servlet"
javadoc: warning - Multiple sources of package comments found for package "javax.servlet.http"
javadoc: warning - Multiple sources of package comments found for package "javax.servlet.annotation"

2195 tests completed, 1 failed, 48 skipped

FAILURE: Build failed with an exception.

* What went wrong:
Execution failed for task ':spring-integration-core:test'.
> There were failing tests. See the report at: file:///opt/bamboo-home/xml-data/build-dir/INT-MASTER-JOB1/spring-integration-core/build/reports/tests/test/index.html

* Try:
Run with --stacktrace option to get the stack trace. Run with --info or --debug option to get more log output. Run with --scan to get full insights.

* Get more help at https://help.gradle.org

BUILD FAILED in 6m 51s