spring-projects/spring-integration master branch

Build: #1789 failed

Job: Default Job failed

Stages & jobs

  1. Default Stage

Job result summary

Completed
Duration
5 minutes
Agent
bamboo-22.af.pivotal.io
Revision
d9e09b93fc66bac7b8961674d2a354f9b60e4545 d9e09b93fc66bac7b8961674d2a354f9b60e4545
Total tests
3372
Fixed in
#1790 (Code changes detected)

Tests

  • 3,372 tests in total
  • 2 tests failed
  • 2 failures are new
  • 112 tests were quarantined / skipped
  • 4 minutes taken in total.
New test failures 2
Status Test Duration
Collapse Failed HttpRequestExecutingMessageHandlerTests acceptHeaderForSerializableResponse History
< 1 sec
org.opentest4j.AssertionFailedError: org.opentest4j.AssertionFailedError: 
Expecting:
 <"404 Not Found: [no body]">
to be equal to:
 <"404 Not Found">
but was not.
org.opentest4j.AssertionFailedError: 
Expecting:
(74 more lines...)
Collapse Failed HttpRequestExecutingMessageHandlerTests acceptHeaderForSerializableResponseMessageExchange History
< 1 sec
org.opentest4j.AssertionFailedError: org.opentest4j.AssertionFailedError: 
Expecting:
 <"404 Not Found: [no body]">
to be equal to:
 <"404 Not Found">
but was not.
org.opentest4j.AssertionFailedError: 
Expecting:
(74 more lines...)

Error summary

The build generated some errors. See the full build log for more details.

*** java.lang.instrument ASSERTION FAILED ***: "!errorOutstanding" with message transform method call failed at JPLISAgent.c line: 844
*** java.lang.instrument ASSERTION FAILED ***: "!errorOutstanding" with message transform method call failed at JPLISAgent.c line: 844
*** java.lang.instrument ASSERTION FAILED ***: "!errorOutstanding" with message transform method call failed at JPLISAgent.c line: 844
*** java.lang.instrument ASSERTION FAILED ***: "!errorOutstanding" with message transform method call failed at JPLISAgent.c line: 844

218 tests completed, 2 failed, 1 skipped

FAILURE: Build failed with an exception.

* What went wrong:
Execution failed for task ':spring-integration-http:test'.
> There were failing tests. See the report at: file:///opt/bamboo-home/xml-data/build-dir/INT-MASTER-JOB1/spring-integration-http/build/reports/tests/test/index.html

* Try:
Run with --stacktrace option to get the stack trace. Run with --info or --debug option to get more log output. Run with --scan to get full insights.

* Get more help at https://help.gradle.org

BUILD FAILED in 5m 14s