spring-projects/spring-integration master branch

Build: #1802 failed

Job: Default Job failed

Stages & jobs

  1. Default Stage

Job result summary

Completed
Duration
2 minutes
Agent
bamboo-24.af.pivotal.io
Revision
516ecbcf8bf9a8240eddc28a59d0643040194365 516ecbcf8bf9a8240eddc28a59d0643040194365
Fixed in
#1803 (Code changes detected)
No failed tests found, a possible compilation error occurred.

Error summary

The build generated some errors. See the full build log for more details.

Could not find test result reports in the /opt/bamboo-home/xml-data/build-dir/INT-MASTER-JOB1 directory.
/opt/bamboo-home/xml-data/build-dir/INT-MASTER-JOB1/spring-integration-rsocket/src/main/java/org/springframework/integration/rsocket/outbound/RSocketOutboundGateway.java:261: error: incompatible types: RetrieveSpec cannot be converted to RequestSpec
                        return requestSpec.data(payload);
                                               ^
/opt/bamboo-home/xml-data/build-dir/INT-MASTER-JOB1/spring-integration-rsocket/src/main/java/org/springframework/integration/rsocket/outbound/RSocketOutboundGateway.java:269: error: incompatible types: RetrieveSpec cannot be converted to RequestSpec
                        return requestSpec.data(payload, (Class<?>) publisherElementType);
                                               ^
/opt/bamboo-home/xml-data/build-dir/INT-MASTER-JOB1/spring-integration-rsocket/src/main/java/org/springframework/integration/rsocket/outbound/RSocketOutboundGateway.java:272: error: incompatible types: RetrieveSpec cannot be converted to RequestSpec
                        return requestSpec.data(payload, (ParameterizedTypeReference<?>) publisherElementType);
                                               ^
3 errors

FAILURE: Build failed with an exception.

* What went wrong:
Execution failed for task ':spring-integration-rsocket:compileJava'.
> Compilation failed; see the compiler error output for details.

* Try:
Run with --stacktrace option to get the stack trace. Run with --info or --debug option to get more log output. Run with --scan to get full insights.

* Get more help at https://help.gradle.org

BUILD FAILED in 2m 54s