spring-projects/spring-integration master branch

Build: #1810 failed

Job: Default Job failed

Stages & jobs

  1. Default Stage

Job result summary

Completed
Duration
7 minutes
Agent
bamboo-24.af.pivotal.io
Revision
d5e314861834d0c5e2fd9122a8bf481027641fc1 d5e314861834d0c5e2fd9122a8bf481027641fc1
Total tests
4544
Fixed in
#1811 (Code changes detected)

Tests

  • 4,544 tests in total
  • 3 tests failed
  • 3 failures are new
  • 256 tests were quarantined / skipped
  • 9 minutes taken in total.
New test failures 3
Status Test Duration
Collapse Failed MongoDbInboundChannelAdapterIntegrationTests testWithNamedMongoFactory History
< 1 sec
java.lang.ClassCastException: java.lang.ClassCastException: com.mongodb.BasicDBObject cannot be cast to org.bson.Document
java.lang.ClassCastException: com.mongodb.BasicDBObject cannot be cast to org.bson.Document
	at org.springframework.integration.mongodb.config.MongoDbInboundChannelAdapterIntegrationTests.testWithNamedMongoFactory(MongoDbInboundChannelAdapterIntegrationTests.java:130)
	at sun.reflect.NativeMethodAccessorImpl.invoke0(Native Method)
	at sun.reflect.NativeMethodAccessorImpl.invoke(NativeMethodAccessorImpl.java:62)
	at sun.reflect.DelegatingMethodAccessorImpl.invoke(DelegatingMethodAccessorImpl.java:43)
	at java.lang.reflect.Method.invoke(Method.java:498)
	at org.junit.runners.model.FrameworkMethod$1.runReflectiveCall(FrameworkMethod.java:50)
(70 more lines...)
Collapse Failed MongoDbMessageSourceTests validatePipelineInModifyOut History
< 1 sec
java.lang.ClassCastException: java.lang.ClassCastException: com.mongodb.BasicDBObject cannot be cast to org.bson.Document
java.lang.ClassCastException: com.mongodb.BasicDBObject cannot be cast to org.bson.Document
	at org.springframework.integration.mongodb.inbound.MongoDbMessageSourceTests.validatePipelineInModifyOut(MongoDbMessageSourceTests.java:290)
	at sun.reflect.NativeMethodAccessorImpl.invoke0(Native Method)
	at sun.reflect.NativeMethodAccessorImpl.invoke(NativeMethodAccessorImpl.java:62)
	at sun.reflect.DelegatingMethodAccessorImpl.invoke(DelegatingMethodAccessorImpl.java:43)
	at java.lang.reflect.Method.invoke(Method.java:498)
	at org.junit.runners.model.FrameworkMethod$1.runReflectiveCall(FrameworkMethod.java:50)
(62 more lines...)
Collapse Failed MongoDbMessageSourceTests validateSuccessfulQueryWithSingleElementIfOneInListAsDbObject History
< 1 sec
java.lang.ClassCastException: java.lang.ClassCastException: com.mongodb.BasicDBObject cannot be cast to org.bson.Document
java.lang.ClassCastException: com.mongodb.BasicDBObject cannot be cast to org.bson.Document
	at org.springframework.integration.mongodb.inbound.MongoDbMessageSourceTests.validateSuccessfulQueryWithSingleElementIfOneInListAsDbObject(MongoDbMessageSourceTests.java:95)
	at sun.reflect.NativeMethodAccessorImpl.invoke0(Native Method)
	at sun.reflect.NativeMethodAccessorImpl.invoke(NativeMethodAccessorImpl.java:62)
	at sun.reflect.DelegatingMethodAccessorImpl.invoke(DelegatingMethodAccessorImpl.java:43)
	at java.lang.reflect.Method.invoke(Method.java:498)
	at org.junit.runners.model.FrameworkMethod$1.runReflectiveCall(FrameworkMethod.java:50)
(62 more lines...)

Error summary

The build generated some errors. See the full build log for more details.

*** java.lang.instrument ASSERTION FAILED ***: "!errorOutstanding" with message transform method call failed at JPLISAgent.c line: 844
*** java.lang.instrument ASSERTION FAILED ***: "!errorOutstanding" with message transform method call failed at JPLISAgent.c line: 844
*** java.lang.instrument ASSERTION FAILED ***: "!errorOutstanding" with message transform method call failed at JPLISAgent.c line: 844
*** java.lang.instrument ASSERTION FAILED ***: "!errorOutstanding" with message transform method call failed at JPLISAgent.c line: 844
javadoc: warning - Multiple sources of package comments found for package "javax.servlet"
javadoc: warning - Multiple sources of package comments found for package "javax.servlet.http"
javadoc: warning - Multiple sources of package comments found for package "javax.servlet.annotation"

168 tests completed, 3 failed, 3 skipped

FAILURE: Build failed with an exception.

* What went wrong:
Execution failed for task ':spring-integration-mongodb:test'.
> There were failing tests. See the report at: file:///opt/bamboo-home/xml-data/build-dir/INT-MASTER-JOB1/spring-integration-mongodb/build/reports/tests/test/index.html

* Try:
Run with --stacktrace option to get the stack trace. Run with --info or --debug option to get more log output. Run with --scan to get full insights.

* Get more help at https://help.gradle.org

BUILD FAILED in 7m 28s