spring-projects/spring-integration master branch

Build: #2034 failed

Job: Default Job failed

Stages & jobs

  1. Default Stage

Job result summary

Completed
Duration
6 minutes
Agent
bamboo-23.af.pivotal.io
Revision
3f5aba2cb9ee326795491e8e444dc90cac71a3dc 3f5aba2cb9ee326795491e8e444dc90cac71a3dc
Total tests
3955
Fixed in
#2037 (Code changes detected)

Tests

  • 3,955 tests in total
  • 4 tests failed
  • 4 failures are new
  • 221 tests were quarantined / skipped
  • 6 minutes taken in total.
New test failures 4
Status Test Duration
Collapse Failed DatagramPacketMulticastSendingHandlerTests verifySendMulticast History
< 1 sec
org.springframework.messaging.MessageHandlingException: org.springframework.messaging.MessageHandlingException: Failed to send UDP packet in the [org.springframework.integration.ip.udp.MulticastSendingMessageHandler@2894f511]; nested exception is java.net.SocketException: Cannot assign requested address (Error setting socket option), failedMessage=GenericMessage [payload=foo, headers={id=ddb53c7c-35ec-6c75-143e-067706876f9c, timestamp=1592417118772}]
org.springframework.messaging.MessageHandlingException: Failed to send UDP packet in the [org.springframework.integration.ip.udp.MulticastSendingMessageHandler@2894f511]; nested exception is java.net.SocketException: Cannot assign requested address (Error setting socket option), failedMessage=GenericMessage [payload=foo, headers={id=ddb53c7c-35ec-6c75-143e-067706876f9c, timestamp=1592417118772}]
	at org.springframework.integration.support.utils.IntegrationUtils.wrapInHandlingExceptionIfNecessary(IntegrationUtils.java:192)
	at org.springframework.integration.ip.udp.UnicastSendingMessageHandler.handleMessageInternal(UnicastSendingMessageHandler.java:291)
	at org.springframework.integration.handler.AbstractMessageHandler.handleMessage(AbstractMessageHandler.java:69)
	at org.springframework.integration.ip.udp.DatagramPacketMulticastSendingHandlerTests.verifySendMulticast(DatagramPacketMulticastSendingHandlerTests.java:104)
	at sun.reflect.NativeMethodAccessorImpl.invoke0(Native Method)
	at sun.reflect.NativeMethodAccessorImpl.invoke(NativeMethodAccessorImpl.java:62)
(77 more lines...)
Collapse Failed UdpChannelAdapterTests testMulticastReceiver History
< 1 sec
org.springframework.messaging.MessagingException: org.springframework.messaging.MessagingException: failed to create DatagramSocket; nested exception is java.net.SocketException: Cannot assign requested address (Error setting socket option)
org.springframework.messaging.MessagingException: failed to create DatagramSocket; nested exception is java.net.SocketException: Cannot assign requested address (Error setting socket option)
	at org.springframework.integration.ip.udp.MulticastReceivingChannelAdapter.getSocket(MulticastReceivingChannelAdapter.java:81)
	at org.springframework.integration.ip.udp.UnicastReceivingChannelAdapter.run(UnicastReceivingChannelAdapter.java:111)
	at java.util.concurrent.ThreadPoolExecutor.runWorker(ThreadPoolExecutor.java:1149)
	at java.util.concurrent.ThreadPoolExecutor$Worker.run(ThreadPoolExecutor.java:624)
	at java.lang.Thread.run(Thread.java:748)
Caused by: java.net.SocketException: Cannot assign requested address (Error setting socket option)
(6 more lines...)
Collapse Failed UdpChannelAdapterTests testMulticastSender History
< 1 sec
org.springframework.messaging.MessagingException: org.springframework.messaging.MessagingException: failed to create DatagramSocket; nested exception is java.net.SocketException: Cannot assign requested address (Error setting socket option)
org.springframework.messaging.MessagingException: failed to create DatagramSocket; nested exception is java.net.SocketException: Cannot assign requested address (Error setting socket option)
	at org.springframework.integration.ip.udp.MulticastReceivingChannelAdapter.getSocket(MulticastReceivingChannelAdapter.java:81)
	at org.springframework.integration.ip.udp.UnicastReceivingChannelAdapter.run(UnicastReceivingChannelAdapter.java:111)
	at java.util.concurrent.ThreadPoolExecutor.runWorker(ThreadPoolExecutor.java:1149)
	at java.util.concurrent.ThreadPoolExecutor$Worker.run(ThreadPoolExecutor.java:624)
	at java.lang.Thread.run(Thread.java:748)
Caused by: java.net.SocketException: Cannot assign requested address (Error setting socket option)
(6 more lines...)
Collapse Failed UdpMulticastEndToEndTests runIt History
1 sec
org.springframework.messaging.MessagingException: org.springframework.messaging.MessagingException: failed to create DatagramSocket; nested exception is java.net.SocketException: Cannot assign requested address (Error setting socket option)
org.springframework.messaging.MessagingException: failed to create DatagramSocket; nested exception is java.net.SocketException: Cannot assign requested address (Error setting socket option)
	at org.springframework.integration.ip.udp.MulticastReceivingChannelAdapter.getSocket(MulticastReceivingChannelAdapter.java:81)
	at org.springframework.integration.ip.udp.UnicastReceivingChannelAdapter.run(UnicastReceivingChannelAdapter.java:111)
	at java.util.concurrent.ThreadPoolExecutor.runWorker(ThreadPoolExecutor.java:1149)
	at java.util.concurrent.ThreadPoolExecutor$Worker.run(ThreadPoolExecutor.java:624)
	at java.lang.Thread.run(Thread.java:748)
Caused by: java.net.SocketException: Cannot assign requested address (Error setting socket option)
(6 more lines...)

Error summary

The build generated some errors. See the full build log for more details.

/opt/bamboo-home/xml-data/build-dir/INT-MASTER-JOB1/spring-integration-core/src/test/java/org/springframework/integration/endpoint/PseudoTransactionalMessageSourceTests.java:53: warning: [deprecation] TransactionSynchronizationAdapter in org.springframework.transaction.support has been deprecated
import org.springframework.transaction.support.TransactionSynchronizationAdapter;
                                              ^
/opt/bamboo-home/xml-data/build-dir/INT-MASTER-JOB1/spring-integration-core/src/test/java/org/springframework/integration/endpoint/PseudoTransactionalMessageSourceTests.java:368: warning: [deprecation] TransactionSynchronizationAdapter in org.springframework.transaction.support has been deprecated
                                return new TransactionSynchronizationAdapter() {
                                           ^
2 warnings
*** java.lang.instrument ASSERTION FAILED ***: "!errorOutstanding" with message transform method call failed at JPLISAgent.c line: 844
*** java.lang.instrument ASSERTION FAILED ***: "!errorOutstanding" with message transform method call failed at JPLISAgent.c line: 844
*** java.lang.instrument ASSERTION FAILED ***: "!errorOutstanding" with message transform method call failed at JPLISAgent.c line: 844
/opt/bamboo-home/xml-data/build-dir/INT-MASTER-JOB1/spring-integration-jdbc/src/test/java/org/springframework/integration/jdbc/DelayerHandlerRescheduleIntegrationTests.java:50: warning: [deprecation] TransactionSynchronizationAdapter in org.springframework.transaction.support has been deprecated
import org.springframework.transaction.support.TransactionSynchronizationAdapter;
                                              ^
/opt/bamboo-home/xml-data/build-dir/INT-MASTER-JOB1/spring-integration-jdbc/src/test/java/org/springframework/integration/jdbc/AggregatorIntegrationTests.java:43: warning: [deprecation] TransactionSynchronizationAdapter in org.springframework.transaction.support has been deprecated
import org.springframework.transaction.support.TransactionSynchronizationAdapter;
                                              ^
/opt/bamboo-home/xml-data/build-dir/INT-MASTER-JOB1/spring-integration-jdbc/src/test/java/org/springframework/integration/jdbc/DelayerHandlerRescheduleIntegrationTests.java:183: warning: [deprecation] TransactionSynchronizationAdapter in org.springframework.transaction.support has been deprecated
        private static class RollbackTxSync extends TransactionSynchronizationAdapter {
                                                    ^
/opt/bamboo-home/xml-data/build-dir/INT-MASTER-JOB1/spring-integration-jdbc/src/test/java/org/springframework/integration/jdbc/AggregatorIntegrationTests.java:99: warning: [deprecation] TransactionSynchronizationAdapter in org.springframework.transaction.support has been deprecated
        private static class RollbackTxSync extends TransactionSynchronizationAdapter {
                                                    ^
4 warnings

324 tests completed, 4 failed, 58 skipped

FAILURE: Build failed with an exception.

* What went wrong:
Execution failed for task ':spring-integration-ip:test'.
> There were failing tests. See the report at: file:///opt/bamboo-home/xml-data/build-dir/INT-MASTER-JOB1/spring-integration-ip/build/reports/tests/test/index.html

* Try:
Run with --stacktrace option to get the stack trace. Run with --info or --debug option to get more log output. Run with --scan to get full insights.

* Get more help at https://help.gradle.org

BUILD FAILED in 6m 55s