spring-projects/spring-integration master branch

Build: #2036 failed

Job: Default Job failed

Stages & jobs

  1. Default Stage

Job result summary

Completed
Duration
7 minutes
Agent
bamboo-14.af.pivotal.io
Revision
9ad348b75f91630c0c197068033eceb4e97d8f75 9ad348b75f91630c0c197068033eceb4e97d8f75
Total tests
3955
Failing since
#2034 (Code changes detected – )
Fixed in
#2037 (Code changes detected)

Tests

  • 3,955 tests in total
  • 2 tests failed
  • 220 tests were quarantined / skipped
  • 6 minutes taken in total.
Existing test failures 2
Status Test Failing since Duration
org.springframework.messaging.MessageHandlingException: org.springframework.messaging.MessageHandlingException: Failed to send UDP packet in the [org.springframework.integration.ip.udp.MulticastSendingMessageHandler@679dee11]; nested exception is java.io.IOException: Network is unreachable (sendto failed), failedMessage=GenericMessage [payload=foobar, headers={id=b59a8d2c-198d-e6b7-ef44-691ff50df1cb, timestamp=1592496658738}]
org.springframework.messaging.MessageHandlingException: Failed to send UDP packet in the [org.springframework.integration.ip.udp.MulticastSendingMessageHandler@679dee11]; nested exception is java.io.IOException: Network is unreachable (sendto failed), failedMessage=GenericMessage [payload=foobar, headers={id=b59a8d2c-198d-e6b7-ef44-691ff50df1cb, timestamp=1592496658738}]
	at org.springframework.integration.support.utils.IntegrationUtils.wrapInHandlingExceptionIfNecessary(IntegrationUtils.java:192)
	at org.springframework.integration.ip.udp.UnicastSendingMessageHandler.handleMessageInternal(UnicastSendingMessageHandler.java:291)
	at org.springframework.integration.handler.AbstractMessageHandler.handleMessage(AbstractMessageHandler.java:69)
	at org.springframework.integration.ip.udp.DatagramPacketMulticastSendingHandlerTests.verifySendMulticastWithAcks(DatagramPacketMulticastSendingHandlerTests.java:179)
	at sun.reflect.NativeMethodAccessorImpl.invoke0(Native Method)
	at sun.reflect.NativeMethodAccessorImpl.invoke(NativeMethodAccessorImpl.java:62)
(73 more lines...)
java.io.IOException: java.io.IOException: Network is unreachable (sendto failed)
java.io.IOException: Network is unreachable (sendto failed)
	at java.net.PlainDatagramSocketImpl.send(Native Method)
	at java.net.DatagramSocket.send(DatagramSocket.java:693)
	at org.springframework.integration.ip.udp.UdpChannelAdapterTests.testMulticastReceiver(UdpChannelAdapterTests.java:268)
	at sun.reflect.NativeMethodAccessorImpl.invoke0(Native Method)
	at sun.reflect.NativeMethodAccessorImpl.invoke(NativeMethodAccessorImpl.java:62)
	at sun.reflect.DelegatingMethodAccessorImpl.invoke(DelegatingMethodAccessorImpl.java:43)
(65 more lines...)

Error summary

The build generated some errors. See the full build log for more details.

/opt/bamboo-home/xml-data/build-dir/INT-MASTER-JOB1/spring-integration-core/src/test/java/org/springframework/integration/endpoint/PseudoTransactionalMessageSourceTests.java:53: warning: [deprecation] TransactionSynchronizationAdapter in org.springframework.transaction.support has been deprecated
import org.springframework.transaction.support.TransactionSynchronizationAdapter;
                                              ^
/opt/bamboo-home/xml-data/build-dir/INT-MASTER-JOB1/spring-integration-core/src/test/java/org/springframework/integration/endpoint/PseudoTransactionalMessageSourceTests.java:368: warning: [deprecation] TransactionSynchronizationAdapter in org.springframework.transaction.support has been deprecated
                                return new TransactionSynchronizationAdapter() {
                                           ^
2 warnings
*** java.lang.instrument ASSERTION FAILED ***: "!errorOutstanding" with message transform method call failed at JPLISAgent.c line: 844
*** java.lang.instrument ASSERTION FAILED ***: "!errorOutstanding" with message transform method call failed at JPLISAgent.c line: 844
*** java.lang.instrument ASSERTION FAILED ***: "!errorOutstanding" with message transform method call failed at JPLISAgent.c line: 844
*** java.lang.instrument ASSERTION FAILED ***: "!errorOutstanding" with message transform method call failed at JPLISAgent.c line: 844
/opt/bamboo-home/xml-data/build-dir/INT-MASTER-JOB1/spring-integration-jdbc/src/test/java/org/springframework/integration/jdbc/DelayerHandlerRescheduleIntegrationTests.java:50: warning: [deprecation] TransactionSynchronizationAdapter in org.springframework.transaction.support has been deprecated
import org.springframework.transaction.support.TransactionSynchronizationAdapter;
                                              ^
/opt/bamboo-home/xml-data/build-dir/INT-MASTER-JOB1/spring-integration-jdbc/src/test/java/org/springframework/integration/jdbc/AggregatorIntegrationTests.java:43: warning: [deprecation] TransactionSynchronizationAdapter in org.springframework.transaction.support has been deprecated
import org.springframework.transaction.support.TransactionSynchronizationAdapter;
                                              ^
/opt/bamboo-home/xml-data/build-dir/INT-MASTER-JOB1/spring-integration-jdbc/src/test/java/org/springframework/integration/jdbc/DelayerHandlerRescheduleIntegrationTests.java:183: warning: [deprecation] TransactionSynchronizationAdapter in org.springframework.transaction.support has been deprecated
        private static class RollbackTxSync extends TransactionSynchronizationAdapter {
                                                    ^
/opt/bamboo-home/xml-data/build-dir/INT-MASTER-JOB1/spring-integration-jdbc/src/test/java/org/springframework/integration/jdbc/AggregatorIntegrationTests.java:99: warning: [deprecation] TransactionSynchronizationAdapter in org.springframework.transaction.support has been deprecated
        private static class RollbackTxSync extends TransactionSynchronizationAdapter {
                                                    ^
4 warnings

324 tests completed, 2 failed, 57 skipped

FAILURE: Build failed with an exception.

* What went wrong:
Execution failed for task ':spring-integration-ip:test'.
> There were failing tests. See the report at: file:///opt/bamboo-home/xml-data/build-dir/INT-MASTER-JOB1/spring-integration-ip/build/reports/tests/test/index.html

* Try:
Run with --stacktrace option to get the stack trace. Run with --info or --debug option to get more log output. Run with --scan to get full insights.

* Get more help at https://help.gradle.org

BUILD FAILED in 7m 21s