spring-projects/spring-integration master branch

Build: #2070 failed

Job: Default Job failed

Stages & jobs

  1. Default Stage

Job result summary

Completed
Duration
2 minutes
Agent
bamboo-22.af.pivotal.io
Revision
e4611d97a1412bc78e34fe0355433a1ef40b5953 e4611d97a1412bc78e34fe0355433a1ef40b5953
Total tests
4360
Fixed in
#2071 (Code changes detected)
No failed test found. A possible compilation error occurred.

Tests

  • 4,360 tests in total
  • 185 tests were quarantined / skipped
  • 7 minutes taken in total.

Error summary

The build generated some errors. See the full build log for more details.

[ant:checkstyle] [ERROR] /opt/bamboo-home/xml-data/build-dir/INT-MASTER-JOB1/spring-integration-jdbc/src/test/java/org/springframework/integration/jdbc/lock/JdbcLockRegistryTests.java:39:1: Wrong order for 'javax.sql.DataSource' import. [ImportOrder]

FAILURE: Build failed with an exception.

* What went wrong:
Execution failed for task ':spring-integration-jdbc:checkstyleTest'.
> Checkstyle rule violations were found. See the report at: file:///opt/bamboo-home/xml-data/build-dir/INT-MASTER-JOB1/spring-integration-jdbc/build/reports/checkstyle/test.html
  Checkstyle files with violations: 1
  Checkstyle violations by severity: [error:1]


* Try:
Run with --stacktrace option to get the stack trace. Run with --info or --debug option to get more log output. Run with --scan to get full insights.

* Get more help at https://help.gradle.org

BUILD FAILED in 2m 0s