spring-projects/spring-integration master branch

Build: #2086 failed

Job: Default Job failed

Stages & jobs

  1. Default Stage

Job result summary

Completed
Duration
4 minutes
Agent
bamboo-17.af.pivotal.io
Revision
6a02b5abe97fabab6003d51b98dd45ab009a6e05 6a02b5abe97fabab6003d51b98dd45ab009a6e05
Total tests
178
Fixed in
#2088 (Code changes detected)
No failed test found. A possible compilation error occurred.

Tests

  • 178 tests in total
  • 1 test was quarantined / skipped
  • 47 seconds taken in total.

Error summary

The build generated some errors. See the full build log for more details.

/opt/bamboo-home/xml-data/build-dir/INT-MASTER-JOB1/spring-integration-core/src/test/java/org/springframework/integration/codec/kryo/KryoCodecTests.java:109: error: not a statement
                codec.encode(map, bos);4
                                       ^
/opt/bamboo-home/xml-data/build-dir/INT-MASTER-JOB1/spring-integration-core/src/test/java/org/springframework/integration/codec/kryo/KryoCodecTests.java:109: error: ';' expected
                codec.encode(map, bos);4
                                        ^
2 errors

FAILURE: Build failed with an exception.

* What went wrong:
Execution failed for task ':spring-integration-core:compileTestJava'.
> Compilation failed; see the compiler error output for details.

* Try:
Run with --stacktrace option to get the stack trace. Run with --info or --debug option to get more log output. Run with --scan to get full insights.

* Get more help at https://help.gradle.org

BUILD FAILED in 4m 48s