spring-projects/spring-integration master branch

Build: #2091 failed

Job: Default Job failed

Stages & jobs

  1. Default Stage

Job result summary

Completed
Duration
8 minutes
Agent
bamboo-22.af.pivotal.io
Revision
f23f3ea63de0f37471b8f2f2b2d267b8ab22ceac f23f3ea63de0f37471b8f2f2b2d267b8ab22ceac
Total tests
3968
Fixed in
#2092 (Code changes detected)

Tests

  • 3,968 tests in total
  • 1 test failed
  • 1 failure is new
  • 220 tests were quarantined / skipped
  • 7 minutes taken in total.
New test failures 1
Status Test Duration
Collapse Failed IpIntegrationTests testCloseStream() History
10 secs
org.springframework.integration.MessageTimeoutException: org.springframework.integration.MessageTimeoutException: Timed out waiting for response, failedMessage=GenericMessage [payload=foo, headers={replyChannel=org.springframework.messaging.core.GenericMessagingTemplate$TemporaryReplyChannel@a3f16cb, errorChannel=org.springframework.messaging.core.GenericMessagingTemplate$TemporaryReplyChannel@a3f16cb, id=97a9fb78-e732-7c3e-bed8-ba6d9b24e2e4, timestamp=1595970371843}]
org.springframework.integration.MessageTimeoutException: Timed out waiting for response, failedMessage=GenericMessage [payload=foo, headers={replyChannel=org.springframework.messaging.core.GenericMessagingTemplate$TemporaryReplyChannel@a3f16cb, errorChannel=org.springframework.messaging.core.GenericMessagingTemplate$TemporaryReplyChannel@a3f16cb, id=97a9fb78-e732-7c3e-bed8-ba6d9b24e2e4, timestamp=1595970371843}]
	at org.springframework.integration.ip.tcp.TcpOutboundGateway.getReply(TcpOutboundGateway.java:300)
	at org.springframework.integration.ip.tcp.TcpOutboundGateway.handleRequestMessage(TcpOutboundGateway.java:235)
	at org.springframework.integration.handler.AbstractReplyProducingMessageHandler.handleMessageInternal(AbstractReplyProducingMessageHandler.java:134)
	at org.springframework.integration.handler.AbstractMessageHandler.handleMessage(AbstractMessageHandler.java:69)
	at org.springframework.integration.dispatcher.AbstractDispatcher.tryOptimizedDispatch(AbstractDispatcher.java:115)
	at org.springframework.integration.dispatcher.UnicastingDispatcher.doDispatch(UnicastingDispatcher.java:133)
(105 more lines...)

Error summary

The build generated some errors. See the full build log for more details.

*** java.lang.instrument ASSERTION FAILED ***: "!errorOutstanding" with message transform method call failed at JPLISAgent.c line: 844
*** java.lang.instrument ASSERTION FAILED ***: "!errorOutstanding" with message transform method call failed at JPLISAgent.c line: 844
*** java.lang.instrument ASSERTION FAILED ***: "!errorOutstanding" with message transform method call failed at JPLISAgent.c line: 844
*** java.lang.instrument ASSERTION FAILED ***: "!errorOutstanding" with message transform method call failed at JPLISAgent.c line: 844

324 tests completed, 1 failed, 57 skipped

FAILURE: Build failed with an exception.

* What went wrong:
Execution failed for task ':spring-integration-ip:test'.
> There were failing tests. See the report at: file:///opt/bamboo-home/xml-data/build-dir/INT-MASTER-JOB1/spring-integration-ip/build/reports/tests/test/index.html

* Try:
Run with --stacktrace option to get the stack trace. Run with --info or --debug option to get more log output. Run with --scan to get full insights.

* Get more help at https://help.gradle.org

BUILD FAILED in 8m 30s