spring-projects/spring-integration master branch

Build: #2102 failed

Job: Default Job failed

Stages & jobs

  1. Default Stage

Job result summary

Completed
Duration
4 minutes
Agent
bamboo-23.af.pivotal.io
Revision
8cf6ff04620dabf4b203d40236676f69b479b6c5 8cf6ff04620dabf4b203d40236676f69b479b6c5
Total tests
5404
Failing since
#2098 (Code changes detected – )
Fixed in
#2103 (Code changes detected)

Tests

  • 5,404 tests in total
  • 6 tests failed
  • 266 tests were quarantined / skipped
  • 14 minutes taken in total.
Existing test failures 6
Status Test Failing since Duration
java.lang.IllegalStateException: java.lang.IllegalStateException: Timeout on blocking read for 10000000000 NANOSECONDS
java.lang.IllegalStateException: Timeout on blocking read for 10000000000 NANOSECONDS
	at reactor.core.publisher.BlockingSingleSubscriber.blockingGet(BlockingSingleSubscriber.java:123)
	at reactor.core.publisher.Mono.block(Mono.java:1585)
	at org.springframework.test.web.reactive.server.DefaultWebTestClient$DefaultRequestBodyUriSpec.exchange(DefaultWebTestClient.java:307)
	at org.springframework.integration.webflux.dsl.WebFluxDslTests.testDynamicHttpEndpoint(WebFluxDslTests.java:276)
	at sun.reflect.NativeMethodAccessorImpl.invoke0(Native Method)
	at sun.reflect.NativeMethodAccessorImpl.invoke(NativeMethodAccessorImpl.java:62)
(88 more lines...)
java.lang.IllegalStateException: java.lang.IllegalStateException: Timeout on blocking read for 10000000000 NANOSECONDS
java.lang.IllegalStateException: Timeout on blocking read for 10000000000 NANOSECONDS
	at reactor.core.publisher.BlockingSingleSubscriber.blockingGet(BlockingSingleSubscriber.java:123)
	at reactor.core.publisher.Mono.block(Mono.java:1585)
	at org.springframework.test.web.reactive.server.DefaultWebTestClient$DefaultRequestBodyUriSpec.exchange(DefaultWebTestClient.java:307)
	at org.springframework.integration.webflux.dsl.WebFluxDslTests.testErrorChannelFlow(WebFluxDslTests.java:344)
	at sun.reflect.NativeMethodAccessorImpl.invoke0(Native Method)
	at sun.reflect.NativeMethodAccessorImpl.invoke(NativeMethodAccessorImpl.java:62)
(88 more lines...)
java.lang.IllegalStateException: java.lang.IllegalStateException: Timeout on blocking read for 10000000000 NANOSECONDS
java.lang.IllegalStateException: Timeout on blocking read for 10000000000 NANOSECONDS
	at reactor.core.publisher.BlockingSingleSubscriber.blockingGet(BlockingSingleSubscriber.java:123)
	at reactor.core.publisher.Mono.block(Mono.java:1585)
	at org.springframework.test.web.reactive.server.DefaultWebTestClient$DefaultRequestBodyUriSpec.exchange(DefaultWebTestClient.java:307)
	at org.springframework.integration.webflux.dsl.WebFluxDslTests.testHttpReactivePost(WebFluxDslTests.java:223)
	at sun.reflect.NativeMethodAccessorImpl.invoke0(Native Method)
	at sun.reflect.NativeMethodAccessorImpl.invoke(NativeMethodAccessorImpl.java:62)
(88 more lines...)
java.lang.IllegalStateException: java.lang.IllegalStateException: Timeout on blocking read for 10000000000 NANOSECONDS
java.lang.IllegalStateException: Timeout on blocking read for 10000000000 NANOSECONDS
	at reactor.core.publisher.BlockingSingleSubscriber.blockingGet(BlockingSingleSubscriber.java:123)
	at reactor.core.publisher.Mono.block(Mono.java:1585)
	at org.springframework.test.web.reactive.server.DefaultWebTestClient$DefaultRequestBodyUriSpec.exchange(DefaultWebTestClient.java:307)
	at org.springframework.integration.webflux.dsl.WebFluxDslTests.testHttpReactivePostWithError(WebFluxDslTests.java:244)
	at sun.reflect.NativeMethodAccessorImpl.invoke0(Native Method)
	at sun.reflect.NativeMethodAccessorImpl.invoke(NativeMethodAccessorImpl.java:62)
(88 more lines...)
java.lang.IllegalStateException: java.lang.IllegalStateException: Timeout on blocking read for 10000000000 NANOSECONDS
java.lang.IllegalStateException: Timeout on blocking read for 10000000000 NANOSECONDS
	at reactor.core.publisher.BlockingSingleSubscriber.blockingGet(BlockingSingleSubscriber.java:123)
	at reactor.core.publisher.Mono.block(Mono.java:1585)
	at org.springframework.test.web.reactive.server.DefaultWebTestClient$DefaultRequestBodyUriSpec.exchange(DefaultWebTestClient.java:307)
	at org.springframework.integration.webflux.dsl.WebFluxDslTests.testSse(WebFluxDslTests.java:254)
	at sun.reflect.NativeMethodAccessorImpl.invoke0(Native Method)
	at sun.reflect.NativeMethodAccessorImpl.invoke(NativeMethodAccessorImpl.java:62)
(88 more lines...)
java.lang.IllegalStateException: java.lang.IllegalStateException: Timeout on blocking read for 10000000000 NANOSECONDS
java.lang.IllegalStateException: Timeout on blocking read for 10000000000 NANOSECONDS
	at reactor.core.publisher.BlockingSingleSubscriber.blockingGet(BlockingSingleSubscriber.java:123)
	at reactor.core.publisher.Mono.block(Mono.java:1585)
	at org.springframework.test.web.reactive.server.DefaultWebTestClient$DefaultRequestBodyUriSpec.exchange(DefaultWebTestClient.java:307)
	at org.springframework.integration.webflux.dsl.WebFluxDslTests.testValidation(WebFluxDslTests.java:313)
	at sun.reflect.NativeMethodAccessorImpl.invoke0(Native Method)
	at sun.reflect.NativeMethodAccessorImpl.invoke(NativeMethodAccessorImpl.java:62)
(88 more lines...)

Error summary

The build generated some errors. See the full build log for more details.

error: source file or directory not found: /opt/bamboo-home/xml-data/build-dir/INT-MASTER-JOB1/spring-integration-amqp/src/main/kotlin
error: source file or directory not found: /opt/bamboo-home/xml-data/build-dir/INT-MASTER-JOB1/spring-integration-event/src/main/kotlin
error: source file or directory not found: /opt/bamboo-home/xml-data/build-dir/INT-MASTER-JOB1/spring-integration-feed/src/main/kotlin
error: source file or directory not found: /opt/bamboo-home/xml-data/build-dir/INT-MASTER-JOB1/spring-integration-file/src/main/kotlin
error: source file or directory not found: /opt/bamboo-home/xml-data/build-dir/INT-MASTER-JOB1/spring-integration-ftp/src/main/kotlin
error: source file or directory not found: /opt/bamboo-home/xml-data/build-dir/INT-MASTER-JOB1/spring-integration-gemfire/src/main/kotlin
error: source file or directory not found: /opt/bamboo-home/xml-data/build-dir/INT-MASTER-JOB1/spring-integration-groovy/src/main/kotlin
error: source file or directory not found: /opt/bamboo-home/xml-data/build-dir/INT-MASTER-JOB1/spring-integration-http/src/main/kotlin
error: source file or directory not found: /opt/bamboo-home/xml-data/build-dir/INT-MASTER-JOB1/spring-integration-ip/src/main/kotlin
error: source file or directory not found: /opt/bamboo-home/xml-data/build-dir/INT-MASTER-JOB1/spring-integration-jdbc/src/main/kotlin
error: source file or directory not found: /opt/bamboo-home/xml-data/build-dir/INT-MASTER-JOB1/spring-integration-jms/src/main/kotlin
error: source file or directory not found: /opt/bamboo-home/xml-data/build-dir/INT-MASTER-JOB1/spring-integration-jmx/src/main/kotlin
error: source file or directory not found: /opt/bamboo-home/xml-data/build-dir/INT-MASTER-JOB1/spring-integration-jpa/src/main/kotlin
error: source file or directory not found: /opt/bamboo-home/xml-data/build-dir/INT-MASTER-JOB1/spring-integration-kafka/src/main/kotlin
error: source file or directory not found: /opt/bamboo-home/xml-data/build-dir/INT-MASTER-JOB1/spring-integration-mail/src/main/kotlin
error: source file or directory not found: /opt/bamboo-home/xml-data/build-dir/INT-MASTER-JOB1/spring-integration-mongodb/src/main/kotlin
error: source file or directory not found: /opt/bamboo-home/xml-data/build-dir/INT-MASTER-JOB1/spring-integration-mqtt/src/main/kotlin
error: source file or directory not found: /opt/bamboo-home/xml-data/build-dir/INT-MASTER-JOB1/spring-integration-r2dbc/src/main/kotlin
error: source file or directory not found: /opt/bamboo-home/xml-data/build-dir/INT-MASTER-JOB1/spring-integration-redis/src/main/kotlin
error: source file or directory not found: /opt/bamboo-home/xml-data/build-dir/INT-MASTER-JOB1/spring-integration-rmi/src/main/kotlin
error: source file or directory not found: /opt/bamboo-home/xml-data/build-dir/INT-MASTER-JOB1/spring-integration-rsocket/src/main/kotlin
error: source file or directory not found: /opt/bamboo-home/xml-data/build-dir/INT-MASTER-JOB1/spring-integration-scripting/src/main/kotlin
error: source file or directory not found: /opt/bamboo-home/xml-data/build-dir/INT-MASTER-JOB1/spring-integration-security/src/main/kotlin
error: source file or directory not found: /opt/bamboo-home/xml-data/build-dir/INT-MASTER-JOB1/spring-integration-sftp/src/main/kotlin
error: source file or directory not found: /opt/bamboo-home/xml-data/build-dir/INT-MASTER-JOB1/spring-integration-stomp/src/main/kotlin
error: source file or directory not found: /opt/bamboo-home/xml-data/build-dir/INT-MASTER-JOB1/spring-integration-stream/src/main/kotlin
error: source file or directory not found: /opt/bamboo-home/xml-data/build-dir/INT-MASTER-JOB1/spring-integration-syslog/src/main/kotlin
error: source file or directory not found: /opt/bamboo-home/xml-data/build-dir/INT-MASTER-JOB1/spring-integration-test/src/main/kotlin
error: source file or directory not found: /opt/bamboo-home/xml-data/build-dir/INT-MASTER-JOB1/spring-integration-test-support/src/main/kotlin
error: source file or directory not found: /opt/bamboo-home/xml-data/build-dir/INT-MASTER-JOB1/spring-integration-webflux/src/main/kotlin
error: source file or directory not found: /opt/bamboo-home/xml-data/build-dir/INT-MASTER-JOB1/spring-integration-websocket/src/main/kotlin
error: source file or directory not found: /opt/bamboo-home/xml-data/build-dir/INT-MASTER-JOB1/spring-integration-ws/src/main/kotlin
error: source file or directory not found: /opt/bamboo-home/xml-data/build-dir/INT-MASTER-JOB1/spring-integration-xml/src/main/kotlin
error: source file or directory not found: /opt/bamboo-home/xml-data/build-dir/INT-MASTER-JOB1/spring-integration-xmpp/src/main/kotlin
error: source file or directory not found: /opt/bamboo-home/xml-data/build-dir/INT-MASTER-JOB1/spring-integration-zookeeper/src/main/kotlin

27 tests completed, 6 failed

FAILURE: Build failed with an exception.

* What went wrong:
Execution failed for task ':spring-integration-webflux:test'.
> There were failing tests. See the report at: file:///opt/bamboo-home/xml-data/build-dir/INT-MASTER-JOB1/spring-integration-webflux/build/reports/tests/test/index.html

* Try:
Run with --stacktrace option to get the stack trace. Run with --info or --debug option to get more log output. Run with --scan to get full insights.

* Get more help at https://help.gradle.org

BUILD FAILED in 4m 35s