spring-projects/spring-integration master branch

Build: #2174 failed

Job: Default Job failed

Stages & jobs

  1. Default Stage

Job result summary

Completed
Duration
5 minutes
Agent
bamboo-19.af.pivotal.io
Revision
a36377a8d8d3886e9c111d411e6513e4e62f693d a36377a8d8d3886e9c111d411e6513e4e62f693d
Total tests
2783
Fixed in
#2176 (Manual run by Artem Bilan)

Tests

  • 2,783 tests in total
  • 1 test failed
  • 1 failure is new
  • 27 tests were quarantined / skipped
  • 2 minutes taken in total.
New test failures 1
Status Test Duration
Collapse Failed FileWritingMessageHandlerTests noFlushAppend() History
< 1 sec
org.opentest4j.AssertionFailedError: org.opentest4j.AssertionFailedError: 
Expecting:
 <9L>
to be equal to:
 <12L>
but was not.
org.opentest4j.AssertionFailedError: 
Expecting:
(98 more lines...)

Error summary

The build generated some errors. See the full build log for more details.

*** java.lang.instrument ASSERTION FAILED ***: "!errorOutstanding" with message transform method call failed at JPLISAgent.c line: 844
*** java.lang.instrument ASSERTION FAILED ***: "!errorOutstanding" with message transform method call failed at JPLISAgent.c line: 844

314 tests completed, 1 failed, 1 skipped

FAILURE: Build failed with an exception.

* What went wrong:
Execution failed for task ':spring-integration-file:test'.
> There were failing tests. See the report at: file:///opt/bamboo-home/xml-data/build-dir/INT-MASTER-JOB1/spring-integration-file/build/reports/tests/test/index.html

* Try:
Run with --stacktrace option to get the stack trace. Run with --info or --debug option to get more log output. Run with --scan to get full insights.

* Get more help at https://help.gradle.org

BUILD FAILED in 5m 31s