Build: #679 failed Scheduled

Build result summary

Details

Completed
Duration
7 minutes
Labels
None
Agent
bamboo-12.af.pivotal.io
Revision
cca50fcadb78aa48d7e2f5f4f0a7cd024a3ee427 cca50fcadb78aa48d7e2f5f4f0a7cd024a3ee427
Total tests
4483
Fixed in
#680 (Scheduled)

Responsible

No one has taken responsibility for this failure

Tests

New test failures 1
Status Test View job Duration
Collapse Failed ImapMailReceiverTests testIdleWithServerDefaultSearchSimple History
Default Job 20 secs
java.lang.AssertionError: java.lang.AssertionError: 
Expecting actual not to be null
java.lang.AssertionError: 
Expecting actual not to be null
	at org.springframework.integration.mail.ImapMailReceiverTests.testIdleWithServerGuts(ImapMailReceiverTests.java:243)
	at org.springframework.integration.mail.ImapMailReceiverTests.testIdleWithServerDefaultSearchSimple(ImapMailReceiverTests.java:167)
	at sun.reflect.NativeMethodAccessorImpl.invoke0(Native Method)
	at sun.reflect.NativeMethodAccessorImpl.invoke(NativeMethodAccessorImpl.java:62)
(76 more lines...)