Build: #710 failed Scheduled with changes by Artem Bilan

Build result summary

Details

Completed
Duration
7 minutes
Labels
None
Revision
bc9aa83aea901a094d164be3d443802d6cb1f26d bc9aa83aea901a094d164be3d443802d6cb1f26d
Total tests
4150
Fixed in
#711 (Scheduled with changes by Artem Bilan)

Tests

Responsible

Code commits

Author Commit Message Commit date
Artem Bilan Artem Bilan bc9aa83aea901a094d164be3d443802d6cb1f26d bc9aa83aea901a094d164be3d443802d6cb1f26d RSocket XML Config support

Tests

New test failures 1
Status Test View job Duration
Collapse Failed JpaPollingChannelAdapterTests testWithJpaQueryAndDeletePerRow History
Default Job 10 secs
java.lang.AssertionError: java.lang.AssertionError: Failed to delete after poll
java.lang.AssertionError: Failed to delete after poll
	at org.springframework.integration.jpa.inbound.JpaPollingChannelAdapterTests.waitForDeletes(JpaPollingChannelAdapterTests.java:315)
	at org.springframework.integration.jpa.inbound.JpaPollingChannelAdapterTests.testWithJpaQueryAndDeletePerRow(JpaPollingChannelAdapterTests.java:392)
	at sun.reflect.NativeMethodAccessorImpl.invoke0(Native Method)
	at sun.reflect.NativeMethodAccessorImpl.invoke(NativeMethodAccessorImpl.java:62)
	at sun.reflect.DelegatingMethodAccessorImpl.invoke(DelegatingMethodAccessorImpl.java:43)
	at java.lang.reflect.Method.invoke(Method.java:498)
(70 more lines...)