Build: #1597 failed Scheduled

Build result summary

Details

Completed
Duration
40 minutes
Labels
None
Agent
bamboo-04.af.pivotal.io
Revision
07655ee62ba7e23b46333bd69eaccac63f2fcf9c 07655ee62ba7e23b46333bd69eaccac63f2fcf9c
Total tests
4815
Fixed in
#1598 (Scheduled)

Responsible

No one has taken responsibility for this failure

Tests

New test failures 1
Status Test View job Duration
Collapse Failed BackToBackAdapterTests testAsync History
Default Job 10 secs
java.lang.AssertionError: java.lang.AssertionError
java.lang.AssertionError
	at org.junit.Assert.fail(Assert.java:86)
	at org.junit.Assert.assertTrue(Assert.java:41)
	at org.junit.Assert.assertNotNull(Assert.java:712)
	at org.junit.Assert.assertNotNull(Assert.java:722)
	at org.springframework.integration.mqtt.BackToBackAdapterTests.testAsync(BackToBackAdapterTests.java:220)
	at sun.reflect.NativeMethodAccessorImpl.invoke0(Native Method)
(51 more lines...)