Build: #1628 failed Scheduled

Build result summary

Details

Completed
Duration
40 minutes
Labels
None
Agent
bamboo-10.af.pivotal.io
Revision
72aaf0b03f013c85b4b2c6261f5377ca92c86b23 72aaf0b03f013c85b4b2c6261f5377ca92c86b23
Total tests
4815
Fixed in
#1629 (Scheduled)

No failed tests found, a possible compilation error occurred.

Responsible

No one has taken responsibility for this failure

Error summary for Default Job

The job generated some errors, drill down into the full build log for more details.

POM relocation to an other version number is not fully supported in Gradle : xml-apis#xml-apis;2.0.2 relocated to xml-apis#xml-apis;1.0.b2.
*** java.lang.instrument ASSERTION FAILED ***: "!errorOutstanding" with message transform method call failed at JPLISAgent.c line: 844
*** java.lang.instrument ASSERTION FAILED ***: "!errorOutstanding" with message transform method call failed at JPLISAgent.c line: 844
*** java.lang.instrument ASSERTION FAILED ***: "!errorOutstanding" with message transform method call failed at JPLISAgent.c line: 844
*** java.lang.instrument ASSERTION FAILED ***: "!errorOutstanding" with message transform method call failed at JPLISAgent.c line: 844
/opt/users/bamboo/.gradle/caches/modules-2/files-2.1/com.gemstone.gemfire/gemfire/8.2.0/c282e20dd018314120c11618bde13193dd1b15ce/gemfire-8.2.0.jar(com/gemstone/gemfire/internal/cache/DistributedRegion.class): warning: Cannot find annotation method 'value()' in type 'SuppressWarnings': class file for edu.umd.cs.findbugs.annotations.SuppressWarnings not found
/opt/users/bamboo/.gradle/caches/modules-2/files-2.1/com.gemstone.gemfire/gemfire/8.2.0/c282e20dd018314120c11618bde13193dd1b15ce/gemfire-8.2.0.jar(com/gemstone/gemfire/internal/cache/DistributedRegion.class): warning: Cannot find annotation method 'value()' in type 'SuppressWarnings': class file for edu.umd.cs.findbugs.annotations.SuppressWarnings not found
/opt/users/bamboo/.gradle/caches/modules-2/files-2.1/com.gemstone.gemfire/gemfire/8.2.0/c282e20dd018314120c11618bde13193dd1b15ce/gemfire-8.2.0.jar(com/gemstone/gemfire/internal/cache/DistributedRegion.class): warning: Cannot find annotation method 'value()' in type 'SuppressWarnings': class file for edu.umd.cs.findbugs.annotations.SuppressWarnings not found
3 warnings
warning: Supported source version 'RELEASE_6' from annotation processor 'org.apache.openjpa.persistence.meta.AnnotationProcessor6' less than -source '1.8'
1 warning

145 tests completed, 1 failed, 2 skipped
asciidoctor: WARNING: http.adoc: line 1719: callout list item index: expected 4 got 3
asciidoctor: WARNING: http.adoc: line 1722: no callouts refer to list item 4
asciidoctor: WARNING: mqtt.adoc: line 7202: invalid style for paragraph: appendix
asciidoctor: WARNING: mqtt.adoc: line 7390: invalid style for paragraph: appendix
asciidoctor: WARNING: mqtt.adoc: line 7733: invalid style for paragraph: appendix
asciidoctor: WARNING: mqtt.adoc: line 7956: invalid style for paragraph: appendix
asciidoctor: WARNING: mqtt.adoc: line 8114: invalid style for paragraph: appendix
asciidoctor: WARNING: mqtt.adoc: line 8664: invalid style for paragraph: appendix
asciidoctor: WARNING: mqtt.adoc: line 9542: invalid style for paragraph: appendix
asciidoctor: WARNING: mqtt.adoc: line 9551: invalid style for paragraph: appendix
asciidoctor: WARNING: http.adoc: line 1719: callout list item index: expected 4 got 3
asciidoctor: WARNING: http.adoc: line 1722: no callouts refer to list item 4
asciidoctor: WARNING: mqtt.adoc: line 7202: invalid style for paragraph: appendix
asciidoctor: WARNING: mqtt.adoc: line 7390: invalid style for paragraph: appendix
asciidoctor: WARNING: mqtt.adoc: line 7733: invalid style for paragraph: appendix
asciidoctor: WARNING: mqtt.adoc: line 7956: invalid style for paragraph: appendix
asciidoctor: WARNING: mqtt.adoc: line 8114: invalid style for paragraph: appendix
asciidoctor: WARNING: mqtt.adoc: line 8664: invalid style for paragraph: appendix
asciidoctor: WARNING: mqtt.adoc: line 9542: invalid style for paragraph: appendix
asciidoctor: WARNING: mqtt.adoc: line 9551: invalid style for paragraph: appendix
*** java.lang.instrument ASSERTION FAILED ***: "!errorOutstanding" with message transform method call failed at JPLISAgent.c line: 844
*** java.lang.instrument ASSERTION FAILED ***: "!errorOutstanding" with message transform method call failed at JPLISAgent.c line: 844
*** java.lang.instrument ASSERTION FAILED ***: "!errorOutstanding" with message transform method call failed at JPLISAgent.c line: 844

FAILURE: Build failed with an exception.

* What went wrong:
Execution failed for task ':spring-integration-redis:springIoJdk8Test'.
> There were failing tests. See the report at: file:///opt/bamboo-home/xml-data/build-dir/INT-MJATS41-JOB1/spring-integration-redis/build/reports/spring-io-jdk8-tests/index.html

* Try:
Run with --stacktrace option to get the stack trace. Run with --info or --debug option to get more log output.