Build: #1597 failed

Job: Default Job failed

Stages & jobs

  1. Default Stage

Job result summary

Completed
Duration
40 minutes
Agent
bamboo-04.af.pivotal.io
Revision
07655ee62ba7e23b46333bd69eaccac63f2fcf9c 07655ee62ba7e23b46333bd69eaccac63f2fcf9c
Total tests
4815
Fixed in
#1598 (Scheduled)

Tests

  • 4,815 tests in total
  • 1 test failed
  • 1 failure is new
  • 136 tests were quarantined / skipped
  • 14 minutes taken in total.
New test failures 1
Status Test Duration
Collapse Failed BackToBackAdapterTests testAsync History
10 secs
java.lang.AssertionError: java.lang.AssertionError
java.lang.AssertionError
	at org.junit.Assert.fail(Assert.java:86)
	at org.junit.Assert.assertTrue(Assert.java:41)
	at org.junit.Assert.assertNotNull(Assert.java:712)
	at org.junit.Assert.assertNotNull(Assert.java:722)
	at org.springframework.integration.mqtt.BackToBackAdapterTests.testAsync(BackToBackAdapterTests.java:220)
	at sun.reflect.NativeMethodAccessorImpl.invoke0(Native Method)
(51 more lines...)

Error summary

The build generated some errors. See the full build log for more details.

*** java.lang.instrument ASSERTION FAILED ***: "!errorOutstanding" with message transform method call failed at JPLISAgent.c line: 844
/opt/users/bamboo/.gradle/caches/modules-2/files-2.1/com.gemstone.gemfire/gemfire/8.2.0/c282e20dd018314120c11618bde13193dd1b15ce/gemfire-8.2.0.jar(com/gemstone/gemfire/internal/cache/DistributedRegion.class): warning: Cannot find annotation method 'value()' in type 'SuppressWarnings': class file for edu.umd.cs.findbugs.annotations.SuppressWarnings not found
/opt/users/bamboo/.gradle/caches/modules-2/files-2.1/com.gemstone.gemfire/gemfire/8.2.0/c282e20dd018314120c11618bde13193dd1b15ce/gemfire-8.2.0.jar(com/gemstone/gemfire/internal/cache/DistributedRegion.class): warning: Cannot find annotation method 'value()' in type 'SuppressWarnings': class file for edu.umd.cs.findbugs.annotations.SuppressWarnings not found
/opt/users/bamboo/.gradle/caches/modules-2/files-2.1/com.gemstone.gemfire/gemfire/8.2.0/c282e20dd018314120c11618bde13193dd1b15ce/gemfire-8.2.0.jar(com/gemstone/gemfire/internal/cache/DistributedRegion.class): warning: Cannot find annotation method 'value()' in type 'SuppressWarnings': class file for edu.umd.cs.findbugs.annotations.SuppressWarnings not found
3 warnings
log4j:ERROR Failed to flush writer,
java.lang.IllegalStateException: Cannot dispatch message, as /0:0:0:0:0:0:0:1:43130 to /0:0:0:0:0:0:0:1:35096 has been stopped.
        at org.gradle.internal.remote.internal.hub.MessageHub.assertRunning(MessageHub.java:161)
        at org.gradle.internal.remote.internal.hub.MessageHub.access$600(MessageHub.java:43)
        at org.gradle.internal.remote.internal.hub.MessageHub$ChannelDispatch.dispatch(MessageHub.java:338)
        at org.gradle.internal.dispatch.ProxyDispatchAdapter$DispatchingInvocationHandler.invoke(ProxyDispatchAdapter.java:93)
        at com.sun.proxy.$Proxy3.output(Unknown Source)
        at org.gradle.api.internal.tasks.testing.processors.TestOutputRedirector$Forwarder.onOutput(TestOutputRedirector.java:75)
        at org.gradle.api.internal.tasks.testing.processors.DefaultStandardOutputRedirector$WriteAction.text(DefaultStandardOutputRedirector.java:89)
        at org.gradle.internal.io.LineBufferingOutputStream.flush(LineBufferingOutputStream.java:101)
        at org.gradle.internal.io.LineBufferingOutputStream.write(LineBufferingOutputStream.java:83)
        at java.io.OutputStream.write(OutputStream.java:116)
        at java.io.PrintStream.write(PrintStream.java:480)
        at org.gradle.internal.io.LinePerThreadBufferingOutputStream.write(LinePerThreadBufferingOutputStream.java:207)
        at sun.nio.cs.StreamEncoder.writeBytes(StreamEncoder.java:221)
        at sun.nio.cs.StreamEncoder.implFlushBuffer(StreamEncoder.java:291)
        at sun.nio.cs.StreamEncoder.implFlush(StreamEncoder.java:295)
        at sun.nio.cs.StreamEncoder.flush(StreamEncoder.java:141)
        at java.io.OutputStreamWriter.flush(OutputStreamWriter.java:229)
        at org.apache.log4j.helpers.QuietWriter.flush(QuietWriter.java:59)
        at org.apache.log4j.WriterAppender.subAppend(WriterAppender.java:324)
        at org.apache.log4j.WriterAppender.append(WriterAppender.java:162)
        at org.apache.log4j.AppenderSkeleton.doAppend(AppenderSkeleton.java:251)
        at org.apache.log4j.helpers.AppenderAttachableImpl.appendLoopOnAppenders(AppenderAttachableImpl.java:66)
        at org.apache.log4j.Category.callAppenders(Category.java:206)
        at org.apache.log4j.Category.forcedLog(Category.java:391)
        at org.apache.log4j.Category.log(Category.java:856)
        at org.apache.commons.logging.impl.Log4JLogger.error(Log4JLogger.java:218)
        at org.springframework.integration.handler.LoggingHandler.handleMessageInternal(LoggingHandler.java:192)
        at org.springframework.integration.handler.AbstractMessageHandler.handleMessage(AbstractMessageHandler.java:127)
        at org.springframework.integration.dispatcher.BroadcastingDispatcher.invokeHandler(BroadcastingDispatcher.java:236)
        at org.springframework.integration.dispatcher.BroadcastingDispatcher.dispatch(BroadcastingDispatcher.java:185)
        at org.springframework.integration.channel.AbstractSubscribableChannel.doSend(AbstractSubscribableChannel.java:89)
        at org.springframework.integration.channel.AbstractMessageChannel.send(AbstractMessageChannel.java:425)
        at org.springframework.integration.channel.MessagePublishingErrorHandler.handleError(MessagePublishingErrorHandler.java:114)
        at org.springframework.scheduling.support.DelegatingErrorHandlingRunnable.run(DelegatingErrorHandlingRunnable.java:60)
        at java.util.concurrent.Executors$RunnableAdapter.call(Executors.java:511)
        at java.util.concurrent.FutureTask.run(FutureTask.java:266)
        at java.util.concurrent.ScheduledThreadPoolExecutor$ScheduledFutureTask.access$201(ScheduledThreadPoolExecutor.java:180)
        at java.util.concurrent.ScheduledThreadPoolExecutor$ScheduledFutureTask.run(ScheduledThreadPoolExecutor.java:293)
        at java.util.concurrent.ThreadPoolExecutor.runWorker(ThreadPoolExecutor.java:1149)
        at java.util.concurrent.ThreadPoolExecutor$Worker.run(ThreadPoolExecutor.java:624)
        at java.lang.Thread.run(Thread.java:748)
warning: Supported source version 'RELEASE_6' from annotation processor 'org.apache.openjpa.persistence.meta.AnnotationProcessor6' less than -source '1.8'
1 warning

145 tests completed, 1 failed, 2 skipped
asciidoctor: WARNING: http.adoc: line 1719: callout list item index: expected 4 got 3
asciidoctor: WARNING: http.adoc: line 1722: no callouts refer to list item 4
asciidoctor: WARNING: mqtt.adoc: line 7202: invalid style for paragraph: appendix
asciidoctor: WARNING: mqtt.adoc: line 7390: invalid style for paragraph: appendix
asciidoctor: WARNING: mqtt.adoc: line 7733: invalid style for paragraph: appendix
asciidoctor: WARNING: mqtt.adoc: line 7956: invalid style for paragraph: appendix
asciidoctor: WARNING: mqtt.adoc: line 8114: invalid style for paragraph: appendix
asciidoctor: WARNING: mqtt.adoc: line 8664: invalid style for paragraph: appendix
asciidoctor: WARNING: mqtt.adoc: line 9542: invalid style for paragraph: appendix
asciidoctor: WARNING: mqtt.adoc: line 9551: invalid style for paragraph: appendix
asciidoctor: WARNING: http.adoc: line 1719: callout list item index: expected 4 got 3
asciidoctor: WARNING: http.adoc: line 1722: no callouts refer to list item 4
asciidoctor: WARNING: mqtt.adoc: line 7202: invalid style for paragraph: appendix
asciidoctor: WARNING: mqtt.adoc: line 7390: invalid style for paragraph: appendix
asciidoctor: WARNING: mqtt.adoc: line 7733: invalid style for paragraph: appendix
asciidoctor: WARNING: mqtt.adoc: line 7956: invalid style for paragraph: appendix
asciidoctor: WARNING: mqtt.adoc: line 8114: invalid style for paragraph: appendix
asciidoctor: WARNING: mqtt.adoc: line 8664: invalid style for paragraph: appendix
asciidoctor: WARNING: mqtt.adoc: line 9542: invalid style for paragraph: appendix
asciidoctor: WARNING: mqtt.adoc: line 9551: invalid style for paragraph: appendix
*** java.lang.instrument ASSERTION FAILED ***: "!errorOutstanding" with message transform method call failed at JPLISAgent.c line: 844
*** java.lang.instrument ASSERTION FAILED ***: "!errorOutstanding" with message transform method call failed at JPLISAgent.c line: 844
*** java.lang.instrument ASSERTION FAILED ***: "!errorOutstanding" with message transform method call failed at JPLISAgent.c line: 844
*** java.lang.instrument ASSERTION FAILED ***: "!errorOutstanding" with message transform method call failed at JPLISAgent.c line: 844

24 tests completed, 1 failed

FAILURE: Build completed with 2 failures.

1: Task failed with an exception.
-----------
* What went wrong:
Execution failed for task ':spring-integration-redis:springIoJdk8Test'.
> There were failing tests. See the report at: file:///opt/bamboo-home/xml-data/build-dir/INT-MJATS41-JOB1/spring-integration-redis/build/reports/spring-io-jdk8-tests/index.html

* Try:
Run with --stacktrace option to get the stack trace. Run with --info or --debug option to get more log output.
==============================================================================

2: Task failed with an exception.
-----------
* What went wrong:
Execution failed for task ':spring-integration-mqtt:test'.
> There were failing tests. See the report at: file:///opt/bamboo-home/xml-data/build-dir/INT-MJATS41-JOB1/spring-integration-mqtt/build/reports/tests/index.html

* Try:
Run with --stacktrace option to get the stack trace. Run with --info or --debug option to get more log output.
==============================================================================