Build: #227 failed Changes by Artem Bilan

Build result summary

Details

Completed
Duration
3 minutes
Labels
None
Agent
bamboo-20.af.pivotal.io
Revision
ef9267bff57db26433688c4adccf088e607f413b ef9267bff57db26433688c4adccf088e607f413b
Total tests
45
Fixed in
#230 (Changes by Artem Bilan)

Tests

Responsible

Code commits

Author Commit Message Commit date
Artem Bilan Artem Bilan ef9267bff57db26433688c4adccf088e607f413b ef9267bff57db26433688c4adccf088e607f413b Add `junit-vintage-engine` for JUnit 4 tests

Tests

New test failures 1
Status Test View job Duration
Collapse Failed DynamoDbMetadataStoreTests initializationError History
Default Job < 1 sec
cloud.localstack.docker.exception.LocalstackDockerException: cloud.localstack.docker.exception.LocalstackDockerException: Could not start the localstack docker container.
cloud.localstack.docker.exception.LocalstackDockerException: Could not start the localstack docker container.
	at cloud.localstack.docker.LocalstackDocker.startup(LocalstackDocker.java:78)
	at cloud.localstack.docker.LocalstackDockerTestRunner.run(LocalstackDockerTestRunner.java:42)
	at org.junit.runner.JUnitCore.run(JUnitCore.java:137)
	at org.junit.runner.JUnitCore.run(JUnitCore.java:115)
	at org.junit.vintage.engine.execution.RunnerExecutor.execute(RunnerExecutor.java:40)
	at java.util.stream.ForEachOps$ForEachOp$OfRef.accept(ForEachOps.java:184)
(49 more lines...)