Build: #228 failed Changes by Artem Bilan

Build result summary

Details

Completed
Duration
3 minutes
Labels
None
Agent
bamboo-23.af.pivotal.io
Revision
f1800f64e2b6947ab48fc874ccf9e30d08900c18 f1800f64e2b6947ab48fc874ccf9e30d08900c18
Total tests
45
Failing since
#227 (Changes by Artem Bilan)
Fixed in
#230 (Changes by Artem Bilan)

Tests

Responsible

Code commits

Author Commit Message Commit date
Artem Bilan Artem Bilan f1800f64e2b6947ab48fc874ccf9e30d08900c18 f1800f64e2b6947ab48fc874ccf9e30d08900c18 `randomizePorts = false` for Local Stack in Docker

Tests

Existing test failures 1
Status Test Failing since View job Duration
cloud.localstack.docker.exception.LocalstackDockerException: cloud.localstack.docker.exception.LocalstackDockerException: Could not start the localstack docker container.
cloud.localstack.docker.exception.LocalstackDockerException: Could not start the localstack docker container.
	at cloud.localstack.docker.LocalstackDocker.startup(LocalstackDocker.java:78)
	at cloud.localstack.docker.LocalstackDockerTestRunner.run(LocalstackDockerTestRunner.java:42)
	at org.junit.runner.JUnitCore.run(JUnitCore.java:137)
	at org.junit.runner.JUnitCore.run(JUnitCore.java:115)
	at org.junit.vintage.engine.execution.RunnerExecutor.execute(RunnerExecutor.java:40)
	at java.util.stream.ForEachOps$ForEachOp$OfRef.accept(ForEachOps.java:184)
(49 more lines...)