Build: #228 failed Changes by Artem Bilan

Logs

The following logs have been generated by the jobs in this plan.
  • Expand all
  • Collapse all
Job Logs
Collapse Default Job Default Stage Download or View
21-Oct-2019 15:16:10 org.springframework.integration.aws.metadata.DynamoDbMetadataStoreTests > initializationError FAILED
21-Oct-2019 15:16:10     cloud.localstack.docker.exception.LocalstackDockerException
21-Oct-2019 15:16:10         Caused by: java.lang.IllegalStateException
21-Oct-2019 15:16:10
21-Oct-2019 15:16:10 45 tests completed, 1 failed, 12 skipped
21-Oct-2019 15:16:10
21-Oct-2019 15:16:10 FAILURE: Build failed with an exception.
21-Oct-2019 15:16:10
21-Oct-2019 15:16:10 * What went wrong:
21-Oct-2019 15:16:10 Execution failed for task ':test'.
21-Oct-2019 15:16:10 > There were failing tests. See the report at: file:///opt/bamboo-home/xml-data/build-dir/INTEXT-AWS-JOB1/build/reports/tests/test/index.html
21-Oct-2019 15:16:10
21-Oct-2019 15:16:10 * Try:
21-Oct-2019 15:16:10 Run with --stacktrace option to get the stack trace. Run with --info or --debug option to get more log output. Run with --scan to get full insights.
21-Oct-2019 15:16:10
21-Oct-2019 15:16:10 * Get more help at https://help.gradle.org
21-Oct-2019 15:16:10
21-Oct-2019 15:16:10 BUILD FAILED in 3m 0s
21-Oct-2019 15:16:10
21-Oct-2019 15:16:10 > Task :test FAILED
21-Oct-2019 15:16:10
21-Oct-2019 15:16:10 Deprecated Gradle features were used in this build, making it incompatible with Gradle 6.0.
21-Oct-2019 15:16:10 Use '--warning-mode all' to show the individual deprecation warnings.
21-Oct-2019 15:16:10 See https://docs.gradle.org/5.6.2/userguide/command_line_interface.html#sec:command_line_warnings
21-Oct-2019 15:16:10 15 actionable tasks: 14 executed, 1 up-to-date