Build: #306 failed Changes by Artem Bilan

Logs

The following logs have been generated by the jobs in this plan.
  • Expand all
  • Collapse all
Job Logs
Collapse Default Job Default Stage Download or View
09-Apr-2021 19:00:27 > Task :processTestResources
09-Apr-2021 19:00:27 > Task :testClasses
09-Apr-2021 19:00:27 > Task :checkstyleTest
09-Apr-2021 19:00:57 > Task :test
09-Apr-2021 19:01:22
09-Apr-2021 19:01:22 KinesisMessageHandlerTests > testKinesisMessageHandler() FAILED
09-Apr-2021 19:01:22     java.lang.NoSuchMethodError at KinesisMessageHandlerTests.java:119
09-Apr-2021 19:02:28
09-Apr-2021 19:02:28 55 tests completed, 1 failed, 2 skipped
09-Apr-2021 19:02:28
09-Apr-2021 19:02:28 > Task :test FAILED
09-Apr-2021 19:02:28
09-Apr-2021 19:02:28 FAILURE: Build failed with an exception.
09-Apr-2021 19:02:28
09-Apr-2021 19:02:28 * What went wrong:
09-Apr-2021 19:02:28 Execution failed for task ':test'.
09-Apr-2021 19:02:28 > There were failing tests. See the report at: file:///opt/bamboo-home/xml-data/build-dir/INTEXT-AWS-JOB1/build/reports/tests/test/index.html
09-Apr-2021 19:02:28
09-Apr-2021 19:02:28 * Try:
09-Apr-2021 19:02:28 Run with --stacktrace option to get the stack trace. Run with --info or --debug option to get more log output. Run with --scan to get full insights.
09-Apr-2021 19:02:28
09-Apr-2021 19:02:28 * Get more help at https://help.gradle.org
09-Apr-2021 19:02:28
09-Apr-2021 19:02:28 BUILD FAILED in 2m 47s
09-Apr-2021 19:02:28 12 actionable tasks: 11 executed, 1 up-to-date