Build: #228 failed

Job: Default Job failed

Stages & jobs

  1. Default Stage

Job result summary

Completed
Duration
3 minutes
Agent
bamboo-23.af.pivotal.io
Revision
f1800f64e2b6947ab48fc874ccf9e30d08900c18 f1800f64e2b6947ab48fc874ccf9e30d08900c18
Total tests
45
Failing since
#227 (Code changes detected – )
Fixed in
#230 (Code changes detected)

Tests

  • 45 tests in total
  • 1 test failed
  • 12 tests were quarantined / skipped
  • 1 second taken in total.
Existing test failures 1
Status Test Failing since Duration
cloud.localstack.docker.exception.LocalstackDockerException: cloud.localstack.docker.exception.LocalstackDockerException: Could not start the localstack docker container.
cloud.localstack.docker.exception.LocalstackDockerException: Could not start the localstack docker container.
	at cloud.localstack.docker.LocalstackDocker.startup(LocalstackDocker.java:78)
	at cloud.localstack.docker.LocalstackDockerTestRunner.run(LocalstackDockerTestRunner.java:42)
	at org.junit.runner.JUnitCore.run(JUnitCore.java:137)
	at org.junit.runner.JUnitCore.run(JUnitCore.java:115)
	at org.junit.vintage.engine.execution.RunnerExecutor.execute(RunnerExecutor.java:40)
	at java.util.stream.ForEachOps$ForEachOp$OfRef.accept(ForEachOps.java:184)
(49 more lines...)

Error summary

The build generated some errors. See the full build log for more details.


45 tests completed, 1 failed, 12 skipped

FAILURE: Build failed with an exception.

* What went wrong:
Execution failed for task ':test'.
> There were failing tests. See the report at: file:///opt/bamboo-home/xml-data/build-dir/INTEXT-AWS-JOB1/build/reports/tests/test/index.html

* Try:
Run with --stacktrace option to get the stack trace. Run with --info or --debug option to get more log output. Run with --scan to get full insights.

* Get more help at https://help.gradle.org

BUILD FAILED in 3m 0s