Build: #3 failed Changes by Spring Operator <[email protected]>

Logs

The following logs have been generated by the jobs in this plan.
  • Expand all
  • Collapse all
Job Logs
Collapse Default Job Default Stage Download or View
25-Mar-2019 16:53:16 Download https://repo.spring.io/libs-snapshot/org/jacoco/org.jacoco.build/0.7.6.201602180812/org.jacoco.build-0.7.6.201602180812.pom
25-Mar-2019 16:53:17 Download https://repo.spring.io/libs-snapshot/org/jacoco/org.jacoco.agent/0.7.6.201602180812/org.jacoco.agent-0.7.6.201602180812.jar
25-Mar-2019 16:53:27 :check
25-Mar-2019 16:53:27 :jacocoTestReport SKIPPED
25-Mar-2019 16:53:27 :build
25-Mar-2019 16:53:27 :dist
25-Mar-2019 16:53:27 :install
25-Mar-2019 16:53:27 :artifactoryPublish
25-Mar-2019 16:53:27 :artifactoryDeploy
25-Mar-2019 16:53:27 Deploying artifact: https://repo.spring.io/libs-snapshot-local/org/springframework/integration/spring-integration-aws/1.0.1.BUILD-SNAPSHOT/spring-integration-aws-1.0.1.BUILD-SNAPSHOT-dist.zip
25-Mar-2019 16:53:28 :artifactoryDeploy FAILED
25-Mar-2019 16:53:28
25-Mar-2019 16:53:28 FAILURE: Build failed with an exception.
25-Mar-2019 16:53:28
25-Mar-2019 16:53:28 * What went wrong:
25-Mar-2019 16:53:28 Execution failed for task ':artifactoryDeploy'.
25-Mar-2019 16:53:28 > java.io.IOException: Failed to deploy file. Status code: 401 Response message: Artifactory returned the following errors:
25-Mar-2019 16:53:28   Unauthorized Status code: 401
25-Mar-2019 16:53:28
25-Mar-2019 16:53:28 * Try:
25-Mar-2019 16:53:28 Run with --stacktrace option to get the stack trace. Run with --info or --debug option to get more log output.
25-Mar-2019 16:53:28
25-Mar-2019 16:53:28 BUILD FAILED
25-Mar-2019 16:53:28
25-Mar-2019 16:53:28 Total time: 49.613 secs