Build result summary

Details

Completed
Duration
37 seconds
Labels
None
Revision
e9316ebf673de1c07bfded13fc45bacd4dde4eb9 e9316ebf673de1c07bfded13fc45bacd4dde4eb9
Total tests
19
Fixed in
#16 (Changes by Artem Bilan)

Tests

Responsible

No one has taken responsibility for this failure

Code commits

Author Commit Message Commit date
Spring Operator <spring-operator@users.noreply.github.com> Spring Operator <spring-operator@users.noreply.github.com> e9316ebf673de1c07bfded13fc45bacd4dde4eb9 e9316ebf673de1c07bfded13fc45bacd4dde4eb9 URL Cleanup
This commit updates URLs to prefer the https protocol. Redirects are not followed to avoid accidentally expanding intentionally shortened URLs (i.e. if using a URL shortener).

# Fixed URLs

## Fixed But Review Recommended
These URLs were fixed, but the https status was not OK. However, the https status was the same as the http request or http redirected to an https URL, so they were migrated. Your review is recommended.

* http://www.springframework.org/schema/integration/flow/spring-integration-flow.xsd (404) with 22 occurrences migrated to:
  https://www.springframework.org/schema/integration/flow/spring-integration-flow.xsd ([https](https://www.springframework.org/schema/integration/flow/spring-integration-flow.xsd) result 404).

## Fixed Success
These URLs were switched to an https URL with a 2xx status. While the status was successful, your review is still recommended.

* http://www.springframework.org/schema/beans/spring-beans-3.1.xsd with 1 occurrences migrated to:
  https://www.springframework.org/schema/beans/spring-beans-3.1.xsd ([https](https://www.springframework.org/schema/beans/spring-beans-3.1.xsd) result 200).
* http://www.springframework.org/schema/beans/spring-beans.xsd with 25 occurrences migrated to:
  https://www.springframework.org/schema/beans/spring-beans.xsd ([https](https://www.springframework.org/schema/beans/spring-beans.xsd) result 200).
* http://www.springframework.org/schema/context/spring-context.xsd with 6 occurrences migrated to:
  https://www.springframework.org/schema/context/spring-context.xsd ([https](https://www.springframework.org/schema/context/spring-context.xsd) result 200).
* http://www.springframework.org/schema/integration/jmx/spring-integration-jmx.xsd with 1 occurrences migrated to:
  https://www.springframework.org/schema/integration/jmx/spring-integration-jmx.xsd ([https](https://www.springframework.org/schema/integration/jmx/spring-integration-jmx.xsd) result 200).
* http://www.springframework.org/schema/integration/scripting/spring-integration-scripting.xsd with 1 occurrences migrated to:
  https://www.springframework.org/schema/integration/scripting/spring-integration-scripting.xsd ([https](https://www.springframework.org/schema/integration/scripting/spring-integration-scripting.xsd) result 200).
* http://www.springframework.org/schema/integration/spring-integration.xsd with 22 occurrences migrated to:
  https://www.springframework.org/schema/integration/spring-integration.xsd ([https](https://www.springframework.org/schema/integration/spring-integration.xsd) result 200).
* http://www.springframework.org/schema/tx/spring-tx.xsd with 1 occurrences migrated to:
  https://www.springframework.org/schema/tx/spring-tx.xsd ([https](https://www.springframework.org/schema/tx/spring-tx.xsd) result 200).
* http://www.springframework.org/schema/util/spring-util.xsd with 11 occurrences migrated to:
  https://www.springframework.org/schema/util/spring-util.xsd ([https](https://www.springframework.org/schema/util/spring-util.xsd) result 200).

# Ignored
These URLs were intentionally ignored.

* http://www.springframework.org/schema/beans with 52 occurrences
* http://www.springframework.org/schema/context with 12 occurrences
* http://www.springframework.org/schema/integration with 44 occurrences
* http://www.springframework.org/schema/integration/flow with 44 occurrences
* http://www.springframework.org/schema/integration/jmx with 2 occurrences
* http://www.springframework.org/schema/integration/scripting with 2 occurrences
* http://www.springframework.org/schema/tx with 2 occurrences
* http://www.springframework.org/schema/util with 22 occurrences
* http://www.w3.org/2001/XMLSchema-instance with 26 occurrences
Spring Operator <spring-operator@users.noreply.github.com> Spring Operator <spring-operator@users.noreply.github.com> 2b6047ac9a208773385da5ccd153506e45b9c78e 2b6047ac9a208773385da5ccd153506e45b9c78e URL Cleanup
This commit updates URLs to prefer the https protocol. Redirects are not followed to avoid accidentally expanding intentionally shortened URLs (i.e. if using a URL shortener).

# Fixed URLs

## Fixed Success
These URLs were switched to an https URL with a 2xx status. While the status was successful, your review is still recommended.

* [ ] http://www.apache.org/licenses/LICENSE-2.0 with 24 occurrences migrated to:
  https://www.apache.org/licenses/LICENSE-2.0 ([https](https://www.apache.org/licenses/LICENSE-2.0) result 200).
Spring Operator <spring-operator@users.noreply.github.com> Spring Operator <spring-operator@users.noreply.github.com> 71e9b061fb3ee74042329f1ae45a1560e38d3403 71e9b061fb3ee74042329f1ae45a1560e38d3403 URL Cleanup
This commit updates URLs to prefer the https protocol. Redirects are not followed to avoid accidentally expanding intentionally shortened URLs (i.e. if using a URL shortener).

# Fixed URLs

## Fixed Success
These URLs were switched to an https URL with a 2xx status. While the status was successful, your review is still recommended.

* [ ] http://www.springframework.org/schema/beans/spring-beans.xsd with 1 occurrences migrated to:
  https://www.springframework.org/schema/beans/spring-beans.xsd ([https](https://www.springframework.org/schema/beans/spring-beans.xsd) result 200).

# Ignored
These URLs were intentionally ignored.

* http://www.springframework.org/schema/beans with 2 occurrences
* http://www.springframework.org/schema/integration with 2 occurrences
* http://www.springframework.org/schema/integration/flow with 2 occurrences
* http://www.springframework.org/schema/tool with 2 occurrences
* http://www.w3.org/2001/XMLSchema with 1 occurrences

Tests

New test failures 18
Status Test View job Duration
Collapse Failed FlowClientNamespaceTests testRequestResponseScenarios History
Default Job < 1 sec
java.lang.IllegalStateException: java.lang.IllegalStateException: Failed to load ApplicationContext
java.lang.IllegalStateException: Failed to load ApplicationContext
	at org.springframework.test.context.cache.DefaultCacheAwareContextLoaderDelegate.loadContext(DefaultCacheAwareContextLoaderDelegate.java:125)
	at org.springframework.test.context.support.DefaultTestContext.getApplicationContext(DefaultTestContext.java:107)
	at org.springframework.test.context.support.DependencyInjectionTestExecutionListener.injectDependencies(DependencyInjectionTestExecutionListener.java:117)
	at org.springframework.test.context.support.DependencyInjectionTestExecutionListener.prepareTestInstance(DependencyInjectionTestExecutionListener.java:83)
	at org.springframework.test.context.TestContextManager.prepareTestInstance(TestContextManager.java:242)
	at org.springframework.test.context.junit4.SpringJUnit4ClassRunner.createTest(SpringJUnit4ClassRunner.java:227)
(81 more lines...)
Collapse Failed FlowClientNamespaceTests testFlowWithInnerProps History
Default Job < 1 sec
java.lang.IllegalStateException: java.lang.IllegalStateException: Failed to load ApplicationContext
java.lang.IllegalStateException: Failed to load ApplicationContext
	at org.springframework.test.context.cache.DefaultCacheAwareContextLoaderDelegate.loadContext(DefaultCacheAwareContextLoaderDelegate.java:125)
	at org.springframework.test.context.support.DefaultTestContext.getApplicationContext(DefaultTestContext.java:107)
	at org.springframework.test.context.support.DependencyInjectionTestExecutionListener.injectDependencies(DependencyInjectionTestExecutionListener.java:117)
	at org.springframework.test.context.support.DependencyInjectionTestExecutionListener.prepareTestInstance(DependencyInjectionTestExecutionListener.java:83)
	at org.springframework.test.context.TestContextManager.prepareTestInstance(TestContextManager.java:242)
	at org.springframework.test.context.junit4.SpringJUnit4ClassRunner.createTest(SpringJUnit4ClassRunner.java:227)
(81 more lines...)
Collapse Failed FlowConfigNamespaceTests test History
Default Job < 1 sec
java.lang.IllegalStateException: java.lang.IllegalStateException: Failed to load ApplicationContext
java.lang.IllegalStateException: Failed to load ApplicationContext
	at org.springframework.test.context.cache.DefaultCacheAwareContextLoaderDelegate.loadContext(DefaultCacheAwareContextLoaderDelegate.java:125)
	at org.springframework.test.context.support.DefaultTestContext.getApplicationContext(DefaultTestContext.java:107)
	at org.springframework.test.context.support.DependencyInjectionTestExecutionListener.injectDependencies(DependencyInjectionTestExecutionListener.java:117)
	at org.springframework.test.context.support.DependencyInjectionTestExecutionListener.prepareTestInstance(DependencyInjectionTestExecutionListener.java:83)
	at org.springframework.test.context.TestContextManager.prepareTestInstance(TestContextManager.java:242)
	at org.springframework.test.context.junit4.SpringJUnit4ClassRunner.createTest(SpringJUnit4ClassRunner.java:227)
(81 more lines...)
Collapse Failed FlowContextTests testChannelConflictShouldThrowException History
Default Job < 1 sec
java.lang.Exception: java.lang.Exception: Unexpected exception, expected<org.springframework.beans.factory.BeanCreationException> but was<org.springframework.beans.factory.xml.XmlBeanDefinitionStoreException>
java.lang.Exception: Unexpected exception, expected<org.springframework.beans.factory.BeanCreationException> but was<org.springframework.beans.factory.xml.XmlBeanDefinitionStoreException>
	at org.junit.internal.runners.statements.ExpectException.evaluate(ExpectException.java:28)
	at org.junit.runners.ParentRunner.runLeaf(ParentRunner.java:325)
	at org.junit.runners.BlockJUnit4ClassRunner.runChild(BlockJUnit4ClassRunner.java:78)
	at org.junit.runners.BlockJUnit4ClassRunner.runChild(BlockJUnit4ClassRunner.java:57)
	at org.junit.runners.ParentRunner$3.run(ParentRunner.java:290)
	at org.junit.runners.ParentRunner$1.schedule(ParentRunner.java:71)
(80 more lines...)
Collapse Failed FlowContextTests testFlowWithJMX History
Default Job < 1 sec
org.springframework.beans.factory.xml.XmlBeanDefinitionStoreException: org.springframework.beans.factory.xml.XmlBeanDefinitionStoreException: Line 308 in XML document from class path resource [org/springframework/integration/flow/config/xml/FlowContextTests-jmx-context.xml] is invalid; nested exception is org.xml.sax.SAXParseException; systemId: https://www.springframework.org/schema/integration/jmx/spring-integration-jmx.xsd; lineNumber: 308; columnNumber: 73; src-resolve: Cannot resolve the name 'integration:smartLifeCycleAttributeGroup' to a(n) 'attribute group' component.
org.springframework.beans.factory.xml.XmlBeanDefinitionStoreException: Line 308 in XML document from class path resource [org/springframework/integration/flow/config/xml/FlowContextTests-jmx-context.xml] is invalid; nested exception is org.xml.sax.SAXParseException; systemId: https://www.springframework.org/schema/integration/jmx/spring-integration-jmx.xsd; lineNumber: 308; columnNumber: 73; src-resolve: Cannot resolve the name 'integration:smartLifeCycleAttributeGroup' to a(n) 'attribute group' component.
	at org.springframework.beans.factory.xml.XmlBeanDefinitionReader.doLoadBeanDefinitions(XmlBeanDefinitionReader.java:398)
	at org.springframework.beans.factory.xml.XmlBeanDefinitionReader.loadBeanDefinitions(XmlBeanDefinitionReader.java:335)
	at org.springframework.beans.factory.xml.XmlBeanDefinitionReader.loadBeanDefinitions(XmlBeanDefinitionReader.java:303)
	at org.springframework.beans.factory.support.AbstractBeanDefinitionReader.loadBeanDefinitions(AbstractBeanDefinitionReader.java:187)
	at org.springframework.beans.factory.support.AbstractBeanDefinitionReader.loadBeanDefinitions(AbstractBeanDefinitionReader.java:223)
	at org.springframework.beans.factory.support.AbstractBeanDefinitionReader.loadBeanDefinitions(AbstractBeanDefinitionReader.java:194)
(92 more lines...)
Collapse Failed FlowWithAutowireTests test History
Default Job < 1 sec
java.lang.IllegalStateException: java.lang.IllegalStateException: Failed to load ApplicationContext
java.lang.IllegalStateException: Failed to load ApplicationContext
	at org.springframework.test.context.cache.DefaultCacheAwareContextLoaderDelegate.loadContext(DefaultCacheAwareContextLoaderDelegate.java:125)
	at org.springframework.test.context.support.DefaultTestContext.getApplicationContext(DefaultTestContext.java:107)
	at org.springframework.test.context.support.DependencyInjectionTestExecutionListener.injectDependencies(DependencyInjectionTestExecutionListener.java:117)
	at org.springframework.test.context.support.DependencyInjectionTestExecutionListener.prepareTestInstance(DependencyInjectionTestExecutionListener.java:83)
	at org.springframework.test.context.TestContextManager.prepareTestInstance(TestContextManager.java:242)
	at org.springframework.test.context.junit4.SpringJUnit4ClassRunner.createTest(SpringJUnit4ClassRunner.java:227)
(81 more lines...)
Collapse Failed FlowWithErrorTests testFlowThrowsExceptionWithGatewayErrorChannel History
Default Job < 1 sec
org.springframework.beans.factory.xml.XmlBeanDefinitionStoreException: org.springframework.beans.factory.xml.XmlBeanDefinitionStoreException: Line 12 in XML document from class path resource [org/springframework/integration/flow/config/xml/FlowWithErrorTests-context.xml] is invalid; nested exception is org.xml.sax.SAXParseException; lineNumber: 12; columnNumber: 32; cvc-complex-type.2.4.c: The matching wildcard is strict, but no declaration can be found for element 'int-flow:flow'.
org.springframework.beans.factory.xml.XmlBeanDefinitionStoreException: Line 12 in XML document from class path resource [org/springframework/integration/flow/config/xml/FlowWithErrorTests-context.xml] is invalid; nested exception is org.xml.sax.SAXParseException; lineNumber: 12; columnNumber: 32; cvc-complex-type.2.4.c: The matching wildcard is strict, but no declaration can be found for element 'int-flow:flow'.
	at org.springframework.beans.factory.xml.XmlBeanDefinitionReader.doLoadBeanDefinitions(XmlBeanDefinitionReader.java:398)
	at org.springframework.beans.factory.xml.XmlBeanDefinitionReader.loadBeanDefinitions(XmlBeanDefinitionReader.java:335)
	at org.springframework.beans.factory.xml.XmlBeanDefinitionReader.loadBeanDefinitions(XmlBeanDefinitionReader.java:303)
	at org.springframework.beans.factory.support.AbstractBeanDefinitionReader.loadBeanDefinitions(AbstractBeanDefinitionReader.java:187)
	at org.springframework.beans.factory.support.AbstractBeanDefinitionReader.loadBeanDefinitions(AbstractBeanDefinitionReader.java:223)
	at org.springframework.beans.factory.support.AbstractBeanDefinitionReader.loadBeanDefinitions(AbstractBeanDefinitionReader.java:194)
(76 more lines...)
Collapse Failed FlowWithErrorTests testDirectCallWithErrorChannel History
Default Job < 1 sec
org.springframework.beans.factory.xml.XmlBeanDefinitionStoreException: org.springframework.beans.factory.xml.XmlBeanDefinitionStoreException: Line 14 in XML document from class path resource [META-INF/spring/integration/flows/subflow5/subflow5-context.xml] is invalid; nested exception is org.xml.sax.SAXParseException; lineNumber: 14; columnNumber: 31; cvc-complex-type.2.4.c: The matching wildcard is strict, but no declaration can be found for element 'int-flow:flow-configuration'.
org.springframework.beans.factory.xml.XmlBeanDefinitionStoreException: Line 14 in XML document from class path resource [META-INF/spring/integration/flows/subflow5/subflow5-context.xml] is invalid; nested exception is org.xml.sax.SAXParseException; lineNumber: 14; columnNumber: 31; cvc-complex-type.2.4.c: The matching wildcard is strict, but no declaration can be found for element 'int-flow:flow-configuration'.
	at org.springframework.beans.factory.xml.XmlBeanDefinitionReader.doLoadBeanDefinitions(XmlBeanDefinitionReader.java:398)
	at org.springframework.beans.factory.xml.XmlBeanDefinitionReader.loadBeanDefinitions(XmlBeanDefinitionReader.java:335)
	at org.springframework.beans.factory.xml.XmlBeanDefinitionReader.loadBeanDefinitions(XmlBeanDefinitionReader.java:303)
	at org.springframework.beans.factory.support.AbstractBeanDefinitionReader.loadBeanDefinitions(AbstractBeanDefinitionReader.java:187)
	at org.springframework.beans.factory.support.AbstractBeanDefinitionReader.loadBeanDefinitions(AbstractBeanDefinitionReader.java:223)
	at org.springframework.beans.factory.support.AbstractBeanDefinitionReader.loadBeanDefinitions(AbstractBeanDefinitionReader.java:194)
(76 more lines...)
Collapse Failed FlowWithErrorTests testWithErrorChannel History
Default Job < 1 sec
org.springframework.beans.factory.xml.XmlBeanDefinitionStoreException: org.springframework.beans.factory.xml.XmlBeanDefinitionStoreException: Line 12 in XML document from class path resource [org/springframework/integration/flow/config/xml/FlowWithErrorTests-context.xml] is invalid; nested exception is org.xml.sax.SAXParseException; lineNumber: 12; columnNumber: 32; cvc-complex-type.2.4.c: The matching wildcard is strict, but no declaration can be found for element 'int-flow:flow'.
org.springframework.beans.factory.xml.XmlBeanDefinitionStoreException: Line 12 in XML document from class path resource [org/springframework/integration/flow/config/xml/FlowWithErrorTests-context.xml] is invalid; nested exception is org.xml.sax.SAXParseException; lineNumber: 12; columnNumber: 32; cvc-complex-type.2.4.c: The matching wildcard is strict, but no declaration can be found for element 'int-flow:flow'.
	at org.springframework.beans.factory.xml.XmlBeanDefinitionReader.doLoadBeanDefinitions(XmlBeanDefinitionReader.java:398)
	at org.springframework.beans.factory.xml.XmlBeanDefinitionReader.loadBeanDefinitions(XmlBeanDefinitionReader.java:335)
	at org.springframework.beans.factory.xml.XmlBeanDefinitionReader.loadBeanDefinitions(XmlBeanDefinitionReader.java:303)
	at org.springframework.beans.factory.support.AbstractBeanDefinitionReader.loadBeanDefinitions(AbstractBeanDefinitionReader.java:187)
	at org.springframework.beans.factory.support.AbstractBeanDefinitionReader.loadBeanDefinitions(AbstractBeanDefinitionReader.java:223)
	at org.springframework.beans.factory.support.AbstractBeanDefinitionReader.loadBeanDefinitions(AbstractBeanDefinitionReader.java:194)
(76 more lines...)
Collapse Failed FlowWithOptionalResponseTests testOneWay History
Default Job < 1 sec
java.lang.IllegalStateException: java.lang.IllegalStateException: Failed to load ApplicationContext
java.lang.IllegalStateException: Failed to load ApplicationContext
	at org.springframework.test.context.cache.DefaultCacheAwareContextLoaderDelegate.loadContext(DefaultCacheAwareContextLoaderDelegate.java:125)
	at org.springframework.test.context.support.DefaultTestContext.getApplicationContext(DefaultTestContext.java:107)
	at org.springframework.test.context.support.DependencyInjectionTestExecutionListener.injectDependencies(DependencyInjectionTestExecutionListener.java:117)
	at org.springframework.test.context.support.DependencyInjectionTestExecutionListener.prepareTestInstance(DependencyInjectionTestExecutionListener.java:83)
	at org.springframework.test.context.TestContextManager.prepareTestInstance(TestContextManager.java:242)
	at org.springframework.test.context.junit4.SpringJUnit4ClassRunner.createTest(SpringJUnit4ClassRunner.java:227)
(81 more lines...)
Collapse Failed FlowWithOptionalResponseTests testOptionResponse History
Default Job < 1 sec
java.lang.IllegalStateException: java.lang.IllegalStateException: Failed to load ApplicationContext
java.lang.IllegalStateException: Failed to load ApplicationContext
	at org.springframework.test.context.cache.DefaultCacheAwareContextLoaderDelegate.loadContext(DefaultCacheAwareContextLoaderDelegate.java:125)
	at org.springframework.test.context.support.DefaultTestContext.getApplicationContext(DefaultTestContext.java:107)
	at org.springframework.test.context.support.DependencyInjectionTestExecutionListener.injectDependencies(DependencyInjectionTestExecutionListener.java:117)
	at org.springframework.test.context.support.DependencyInjectionTestExecutionListener.prepareTestInstance(DependencyInjectionTestExecutionListener.java:83)
	at org.springframework.test.context.TestContextManager.prepareTestInstance(TestContextManager.java:242)
	at org.springframework.test.context.junit4.SpringJUnit4ClassRunner.createTest(SpringJUnit4ClassRunner.java:227)
(81 more lines...)
Collapse Failed FlowWithReferencesTests testRequestResponseScenarios History
Default Job < 1 sec
java.lang.IllegalStateException: java.lang.IllegalStateException: Failed to load ApplicationContext
java.lang.IllegalStateException: Failed to load ApplicationContext
	at org.springframework.test.context.cache.DefaultCacheAwareContextLoaderDelegate.loadContext(DefaultCacheAwareContextLoaderDelegate.java:125)
	at org.springframework.test.context.support.DefaultTestContext.getApplicationContext(DefaultTestContext.java:107)
	at org.springframework.test.context.support.DependencyInjectionTestExecutionListener.injectDependencies(DependencyInjectionTestExecutionListener.java:117)
	at org.springframework.test.context.support.DependencyInjectionTestExecutionListener.prepareTestInstance(DependencyInjectionTestExecutionListener.java:83)
	at org.springframework.test.context.TestContextManager.prepareTestInstance(TestContextManager.java:242)
	at org.springframework.test.context.junit4.SpringJUnit4ClassRunner.createTest(SpringJUnit4ClassRunner.java:227)
(81 more lines...)
Collapse Failed NestedFlowTests testNestedFlowOneExecution History
Default Job < 1 sec
java.lang.IllegalStateException: java.lang.IllegalStateException: Failed to load ApplicationContext
java.lang.IllegalStateException: Failed to load ApplicationContext
	at org.springframework.test.context.cache.DefaultCacheAwareContextLoaderDelegate.loadContext(DefaultCacheAwareContextLoaderDelegate.java:125)
	at org.springframework.test.context.support.DefaultTestContext.getApplicationContext(DefaultTestContext.java:107)
	at org.springframework.test.context.support.DependencyInjectionTestExecutionListener.injectDependencies(DependencyInjectionTestExecutionListener.java:117)
	at org.springframework.test.context.support.DependencyInjectionTestExecutionListener.prepareTestInstance(DependencyInjectionTestExecutionListener.java:83)
	at org.springframework.test.context.TestContextManager.prepareTestInstance(TestContextManager.java:242)
	at org.springframework.test.context.junit4.SpringJUnit4ClassRunner.createTest(SpringJUnit4ClassRunner.java:227)
(81 more lines...)
Collapse Failed NestedFlowTests testNestedFlowMultipleExecutions History
Default Job < 1 sec
java.lang.IllegalStateException: java.lang.IllegalStateException: Failed to load ApplicationContext
java.lang.IllegalStateException: Failed to load ApplicationContext
	at org.springframework.test.context.cache.DefaultCacheAwareContextLoaderDelegate.loadContext(DefaultCacheAwareContextLoaderDelegate.java:125)
	at org.springframework.test.context.support.DefaultTestContext.getApplicationContext(DefaultTestContext.java:107)
	at org.springframework.test.context.support.DependencyInjectionTestExecutionListener.injectDependencies(DependencyInjectionTestExecutionListener.java:117)
	at org.springframework.test.context.support.DependencyInjectionTestExecutionListener.prepareTestInstance(DependencyInjectionTestExecutionListener.java:83)
	at org.springframework.test.context.TestContextManager.prepareTestInstance(TestContextManager.java:242)
	at org.springframework.test.context.junit4.SpringJUnit4ClassRunner.createTest(SpringJUnit4ClassRunner.java:227)
(81 more lines...)
Collapse Failed TransactionalFlowTests testFlowRollbackWithGatewayErrorChannel History
Default Job < 1 sec
org.springframework.beans.factory.xml.XmlBeanDefinitionStoreException: org.springframework.beans.factory.xml.XmlBeanDefinitionStoreException: Line 10 in XML document from class path resource [org/springframework/integration/flow/config/xml/TransactionalFlowTests-context.xml] is invalid; nested exception is org.xml.sax.SAXParseException; lineNumber: 10; columnNumber: 42; cvc-complex-type.2.4.c: The matching wildcard is strict, but no declaration can be found for element 'int-flow:flow'.
org.springframework.beans.factory.xml.XmlBeanDefinitionStoreException: Line 10 in XML document from class path resource [org/springframework/integration/flow/config/xml/TransactionalFlowTests-context.xml] is invalid; nested exception is org.xml.sax.SAXParseException; lineNumber: 10; columnNumber: 42; cvc-complex-type.2.4.c: The matching wildcard is strict, but no declaration can be found for element 'int-flow:flow'.
	at org.springframework.beans.factory.xml.XmlBeanDefinitionReader.doLoadBeanDefinitions(XmlBeanDefinitionReader.java:398)
	at org.springframework.beans.factory.xml.XmlBeanDefinitionReader.loadBeanDefinitions(XmlBeanDefinitionReader.java:335)
	at org.springframework.beans.factory.xml.XmlBeanDefinitionReader.loadBeanDefinitions(XmlBeanDefinitionReader.java:303)
	at org.springframework.beans.factory.support.AbstractBeanDefinitionReader.loadBeanDefinitions(AbstractBeanDefinitionReader.java:187)
	at org.springframework.beans.factory.support.AbstractBeanDefinitionReader.loadBeanDefinitions(AbstractBeanDefinitionReader.java:223)
	at org.springframework.beans.factory.support.AbstractBeanDefinitionReader.loadBeanDefinitions(AbstractBeanDefinitionReader.java:194)
(76 more lines...)
Collapse Failed TransactionalFlowTests testFlowDirectCommit History
Default Job < 1 sec
org.springframework.beans.factory.xml.XmlBeanDefinitionStoreException: org.springframework.beans.factory.xml.XmlBeanDefinitionStoreException: Line 14 in XML document from class path resource [META-INF/spring/integration/flows/transactional-flow/flow-context.xml] is invalid; nested exception is org.xml.sax.SAXParseException; lineNumber: 14; columnNumber: 31; cvc-complex-type.2.4.c: The matching wildcard is strict, but no declaration can be found for element 'int-flow:flow-configuration'.
org.springframework.beans.factory.xml.XmlBeanDefinitionStoreException: Line 14 in XML document from class path resource [META-INF/spring/integration/flows/transactional-flow/flow-context.xml] is invalid; nested exception is org.xml.sax.SAXParseException; lineNumber: 14; columnNumber: 31; cvc-complex-type.2.4.c: The matching wildcard is strict, but no declaration can be found for element 'int-flow:flow-configuration'.
	at org.springframework.beans.factory.xml.XmlBeanDefinitionReader.doLoadBeanDefinitions(XmlBeanDefinitionReader.java:398)
	at org.springframework.beans.factory.xml.XmlBeanDefinitionReader.loadBeanDefinitions(XmlBeanDefinitionReader.java:335)
	at org.springframework.beans.factory.xml.XmlBeanDefinitionReader.loadBeanDefinitions(XmlBeanDefinitionReader.java:303)
	at org.springframework.beans.factory.support.AbstractBeanDefinitionReader.loadBeanDefinitions(AbstractBeanDefinitionReader.java:187)
	at org.springframework.beans.factory.support.AbstractBeanDefinitionReader.loadBeanDefinitions(AbstractBeanDefinitionReader.java:223)
	at org.springframework.beans.factory.support.AbstractBeanDefinitionReader.loadBeanDefinitions(AbstractBeanDefinitionReader.java:194)
(76 more lines...)
Collapse Failed TransactionalFlowTests testFlowDirectRollback History
Default Job < 1 sec
org.springframework.beans.factory.xml.XmlBeanDefinitionStoreException: org.springframework.beans.factory.xml.XmlBeanDefinitionStoreException: Line 14 in XML document from class path resource [META-INF/spring/integration/flows/transactional-flow/flow-context.xml] is invalid; nested exception is org.xml.sax.SAXParseException; lineNumber: 14; columnNumber: 31; cvc-complex-type.2.4.c: The matching wildcard is strict, but no declaration can be found for element 'int-flow:flow-configuration'.
org.springframework.beans.factory.xml.XmlBeanDefinitionStoreException: Line 14 in XML document from class path resource [META-INF/spring/integration/flows/transactional-flow/flow-context.xml] is invalid; nested exception is org.xml.sax.SAXParseException; lineNumber: 14; columnNumber: 31; cvc-complex-type.2.4.c: The matching wildcard is strict, but no declaration can be found for element 'int-flow:flow-configuration'.
	at org.springframework.beans.factory.xml.XmlBeanDefinitionReader.doLoadBeanDefinitions(XmlBeanDefinitionReader.java:398)
	at org.springframework.beans.factory.xml.XmlBeanDefinitionReader.loadBeanDefinitions(XmlBeanDefinitionReader.java:335)
	at org.springframework.beans.factory.xml.XmlBeanDefinitionReader.loadBeanDefinitions(XmlBeanDefinitionReader.java:303)
	at org.springframework.beans.factory.support.AbstractBeanDefinitionReader.loadBeanDefinitions(AbstractBeanDefinitionReader.java:187)
	at org.springframework.beans.factory.support.AbstractBeanDefinitionReader.loadBeanDefinitions(AbstractBeanDefinitionReader.java:223)
	at org.springframework.beans.factory.support.AbstractBeanDefinitionReader.loadBeanDefinitions(AbstractBeanDefinitionReader.java:194)
(76 more lines...)
Collapse Failed TransactionalFlowTests testFlowCommit History
Default Job < 1 sec
org.springframework.beans.factory.xml.XmlBeanDefinitionStoreException: org.springframework.beans.factory.xml.XmlBeanDefinitionStoreException: Line 10 in XML document from class path resource [org/springframework/integration/flow/config/xml/TransactionalFlowTests-context.xml] is invalid; nested exception is org.xml.sax.SAXParseException; lineNumber: 10; columnNumber: 42; cvc-complex-type.2.4.c: The matching wildcard is strict, but no declaration can be found for element 'int-flow:flow'.
org.springframework.beans.factory.xml.XmlBeanDefinitionStoreException: Line 10 in XML document from class path resource [org/springframework/integration/flow/config/xml/TransactionalFlowTests-context.xml] is invalid; nested exception is org.xml.sax.SAXParseException; lineNumber: 10; columnNumber: 42; cvc-complex-type.2.4.c: The matching wildcard is strict, but no declaration can be found for element 'int-flow:flow'.
	at org.springframework.beans.factory.xml.XmlBeanDefinitionReader.doLoadBeanDefinitions(XmlBeanDefinitionReader.java:398)
	at org.springframework.beans.factory.xml.XmlBeanDefinitionReader.loadBeanDefinitions(XmlBeanDefinitionReader.java:335)
	at org.springframework.beans.factory.xml.XmlBeanDefinitionReader.loadBeanDefinitions(XmlBeanDefinitionReader.java:303)
	at org.springframework.beans.factory.support.AbstractBeanDefinitionReader.loadBeanDefinitions(AbstractBeanDefinitionReader.java:187)
	at org.springframework.beans.factory.support.AbstractBeanDefinitionReader.loadBeanDefinitions(AbstractBeanDefinitionReader.java:223)
	at org.springframework.beans.factory.support.AbstractBeanDefinitionReader.loadBeanDefinitions(AbstractBeanDefinitionReader.java:194)
(76 more lines...)

Jira issues

IssueDescriptionStatus
Unknown Issue TypeLICENSE-2Could not obtain issue details from Jira