Build: #21 failed Changes by Artem Bilan

Logs

The following logs have been generated by the jobs in this plan.
  • Expand all
  • Collapse all
Job Logs
Collapse Default Job Default Stage Download or View
28-Mar-2019 15:26:10                 Caused by: java.lang.IllegalStateException at SftpTests.java:190
28-Mar-2019 15:26:10                     Caused by: com.jcraft.jsch.JSchException at SftpTests.java:190
28-Mar-2019 15:26:10
28-Mar-2019 15:26:10 org.springframework.integration.dsl.test.sftp.SftpTests > testSftpOutboundFlow FAILED
28-Mar-2019 15:26:10     org.springframework.messaging.MessagingException at SftpTests.java:152
28-Mar-2019 15:26:10         Caused by: org.springframework.messaging.MessagingException at SftpTests.java:152
28-Mar-2019 15:26:10             Caused by: java.lang.IllegalStateException at SftpTests.java:152
28-Mar-2019 15:26:10                 Caused by: java.lang.IllegalStateException at SftpTests.java:152
28-Mar-2019 15:26:10                     Caused by: com.jcraft.jsch.JSchException at SftpTests.java:152
28-Mar-2019 15:26:11
28-Mar-2019 15:26:11 79 tests completed, 4 failed
28-Mar-2019 15:26:11 :test FAILED
28-Mar-2019 15:26:11
28-Mar-2019 15:26:11 FAILURE: Build failed with an exception.
28-Mar-2019 15:26:11
28-Mar-2019 15:26:11 * What went wrong:
28-Mar-2019 15:26:11 Execution failed for task ':test'.
28-Mar-2019 15:26:11 > There were failing tests. See the report at: file:///opt/bamboo-home/xml-data/build-dir/INTEXT-JD1-JOB1/build/reports/tests/index.html
28-Mar-2019 15:26:11
28-Mar-2019 15:26:11 * Try:
28-Mar-2019 15:26:11 Run with --stacktrace option to get the stack trace. Run with --info or --debug option to get more log output.
28-Mar-2019 15:26:11
28-Mar-2019 15:26:11 BUILD FAILED
28-Mar-2019 15:26:11
28-Mar-2019 15:26:11 Total time: 2 mins 20.425 secs