Build result summary

Details

Completed
Duration
30 seconds
Labels
None
Revision
86a589ccdbc4311abaecff6ac453b085158e3e54 86a589ccdbc4311abaecff6ac453b085158e3e54
No failed tests found, a possible compilation error occurred.

Responsible

No one has taken responsibility for this failure

Code commits

Author Commit Message Commit date
Spring Operator <spring-operator@users.noreply.github.com> Spring Operator <spring-operator@users.noreply.github.com> 86a589ccdbc4311abaecff6ac453b085158e3e54 86a589ccdbc4311abaecff6ac453b085158e3e54 URL Cleanup
This commit updates URLs to prefer the https protocol. Redirects are not followed to avoid accidentally expanding intentionally shortened URLs (i.e. if using a URL shortener).

# Fixed URLs

## Fixed But Review Recommended
These URLs were fixed, but the https status was not OK. However, the https status was the same as the http request or http redirected to an https URL, so they were migrated. Your review is recommended.

* http://services.gradle.org/distributions/gradle- (404) migrated to:
  https://services.gradle.org/distributions/gradle- ([https](https://services.gradle.org/distributions/gradle-) result 404).

## Fixed Success
These URLs were fixed successfully.

* http://projects.spring.io/spring-integration/ migrated to:
  https://projects.spring.io/spring-integration/ ([https](https://projects.spring.io/spring-integration/) result 200).
* http://springsource.org (301) migrated to:
  https://spring.io ([https](https://springsource.org) result 200).
* http://spring.io migrated to:
  https://spring.io ([https](https://spring.io) result 200).
* http://www.apache.org/licenses/LICENSE-2.0.txt migrated to:
  https://www.apache.org/licenses/LICENSE-2.0.txt ([https](https://www.apache.org/licenses/LICENSE-2.0.txt) result 200).
* http://www.project-voldemort.com/voldemort/configuration.html migrated to:
  https://www.project-voldemort.com/voldemort/configuration.html ([https](https://www.project-voldemort.com/voldemort/configuration.html) result 200).
* http://repo.springsource.org/libs-milestone migrated to:
  https://repo.springsource.org/libs-milestone ([https](https://repo.springsource.org/libs-milestone) result 301).
* http://repo.springsource.org/libs-snapshot migrated to:
  https://repo.springsource.org/libs-snapshot ([https](https://repo.springsource.org/libs-snapshot) result 301).
* http://repo.springsource.org/plugins-release migrated to:
  https://repo.springsource.org/plugins-release ([https](https://repo.springsource.org/plugins-release) result 301).
* http://www.gradle.org/docs/current/dsl/org.gradle.api.artifacts.ConfigurationContainer.html migrated to:
  https://www.gradle.org/docs/current/dsl/org.gradle.api.artifacts.ConfigurationContainer.html ([https](https://www.gradle.org/docs/current/dsl/org.gradle.api.artifacts.ConfigurationContainer.html) result 301).
* http://www.gradle.org/docs/current/userguide/dependency_management.html migrated to:
  https://www.gradle.org/docs/current/userguide/dependency_management.html ([https](https://www.gradle.org/docs/current/userguide/dependency_management.html) result 301).
* http://www.springsource.org/spring-integration migrated to:
  https://www.springsource.org/spring-integration ([https](https://www.springsource.org/spring-integration) result 301).
* http://repo.spring.io/libs-milestone migrated to:
  https://repo.spring.io/libs-milestone ([https](https://repo.spring.io/libs-milestone) result 302).
* http://repo.spring.io/libs-snapshot migrated to:
  https://repo.spring.io/libs-snapshot ([https](https://repo.spring.io/libs-snapshot) result 302).
* http://repo.spring.io/libs-staging-local migrated to:
  https://repo.spring.io/libs-staging-local ([https](https://repo.spring.io/libs-staging-local) result 302).
* http://repo.spring.io/plugins-release migrated to:
  https://repo.spring.io/plugins-release ([https](https://repo.spring.io/plugins-release) result 302).

# Ignored
These URLs were intentionally ignored.

* http://maven.apache.org/POM/4.0.0
* http://maven.apache.org/xsd/maven-4.0.0.xsd
* http://www.w3.org/2001/XMLSchema-instance

Jira issues

IssueDescriptionStatus
Unknown Issue TypeLICENSE-2Could not obtain issue details from Jira

Error summary for Default Job

The job generated some errors, drill down into the full build log for more details.

Could not find test result reports in the /opt/bamboo-home/xml-data/build-dir/INTEXT-PRINT-JOB1 directory.
        at org.gradle.launcher.bootstrap.EntryPoint.run(EntryPoint.java:45)
        at org.gradle.launcher.Main.main(Main.java:39)
        at sun.reflect.NativeMethodAccessorImpl.invoke0(Native Method)
        at sun.reflect.NativeMethodAccessorImpl.invoke(NativeMethodAccessorImpl.java:57)
        at sun.reflect.DelegatingMethodAccessorImpl.invoke(DelegatingMethodAccessorImpl.java:43)
        at java.lang.reflect.Method.invoke(Method.java:606)
        at org.gradle.launcher.bootstrap.ProcessBootstrap.runNoExit(ProcessBootstrap.java:50)
        at org.gradle.launcher.bootstrap.ProcessBootstrap.run(ProcessBootstrap.java:32)
        at org.gradle.launcher.GradleMain.main(GradleMain.java:26)
        at sun.reflect.NativeMethodAccessorImpl.invoke0(Native Method)
        at sun.reflect.NativeMethodAccessorImpl.invoke(NativeMethodAccessorImpl.java:57)
        at sun.reflect.DelegatingMethodAccessorImpl.invoke(DelegatingMethodAccessorImpl.java:43)
        at java.lang.reflect.Method.invoke(Method.java:606)
        at org.gradle.wrapper.BootstrapMainStarter.start(BootstrapMainStarter.java:33)
        at org.gradle.wrapper.WrapperExecutor.execute(WrapperExecutor.java:130)
        at org.gradle.wrapper.GradleWrapperMain.main(GradleWrapperMain.java:48)
Caused by: org.gradle.listener.ListenerNotificationException: Failed to notify project evaluation listener.
        at org.gradle.listener.BroadcastDispatch.dispatch(BroadcastDispatch.java:90)
        at org.gradle.listener.BroadcastDispatch.dispatch(BroadcastDispatch.java:30)
        at org.gradle.messaging.dispatch.ProxyDispatchAdapter$DispatchingInvocationHandler.invoke(ProxyDispatchAdapter.java:93)
        at com.sun.proxy.$Proxy10.afterEvaluate(Unknown Source)
        at sun.reflect.NativeMethodAccessorImpl.invoke0(Native Method)
        at sun.reflect.NativeMethodAccessorImpl.invoke(NativeMethodAccessorImpl.java:57)
        at sun.reflect.DelegatingMethodAccessorImpl.invoke(DelegatingMethodAccessorImpl.java:43)
        at java.lang.reflect.Method.invoke(Method.java:606)
        at org.gradle.messaging.dispatch.ReflectionDispatch.dispatch(ReflectionDispatch.java:35)
        at org.gradle.messaging.dispatch.ReflectionDispatch.dispatch(ReflectionDispatch.java:24)
        at org.gradle.listener.BroadcastDispatch.dispatch(BroadcastDispatch.java:81)
        ... 41 more
Caused by: org.gradle.listener.ListenerNotificationException: Failed to notify project evaluation listener.
        at org.gradle.listener.BroadcastDispatch.dispatch(BroadcastDispatch.java:90)
        at org.gradle.listener.BroadcastDispatch.dispatch(BroadcastDispatch.java:30)
        at org.gradle.messaging.dispatch.ProxyDispatchAdapter$DispatchingInvocationHandler.invoke(ProxyDispatchAdapter.java:93)
        at com.sun.proxy.$Proxy10.afterEvaluate(Unknown Source)
        at sun.reflect.NativeMethodAccessorImpl.invoke0(Native Method)
        at sun.reflect.NativeMethodAccessorImpl.invoke(NativeMethodAccessorImpl.java:57)
        at sun.reflect.DelegatingMethodAccessorImpl.invoke(DelegatingMethodAccessorImpl.java:43)
        at java.lang.reflect.Method.invoke(Method.java:606)
        at org.gradle.messaging.dispatch.ReflectionDispatch.dispatch(ReflectionDispatch.java:35)
        at org.gradle.messaging.dispatch.ReflectionDispatch.dispatch(ReflectionDispatch.java:24)
        at org.gradle.listener.BroadcastDispatch.dispatch(BroadcastDispatch.java:81)
        ... 51 more
Caused by: org.gradle.listener.ListenerNotificationException: Failed to notify project evaluation listener.
        at org.gradle.listener.BroadcastDispatch.dispatch(BroadcastDispatch.java:90)
        at org.gradle.listener.BroadcastDispatch.dispatch(BroadcastDispatch.java:30)
        at org.gradle.listener.BroadcastDispatch.dispatch(BroadcastDispatch.java:81)
        ... 61 more
Caused by: java.lang.NoSuchMethodError: org.jfrog.gradle.plugin.artifactory.task.ArtifactoryTask.finalizedBy([Ljava/lang/Object;)Lorg/gradle/api/Task;
        at org.jfrog.gradle.plugin.artifactory.task.ArtifactoryTask.finalizeByDeployTask(ArtifactoryTask.java:235)
        at org.jfrog.gradle.plugin.artifactory.task.ArtifactoryTask$finalizeByDeployTask.call(Unknown Source)
        at org.codehaus.groovy.runtime.callsite.CallSiteArray.defaultCall(CallSiteArray.java:42)
        at org.codehaus.groovy.runtime.callsite.AbstractCallSite.call(AbstractCallSite.java:108)
        at org.codehaus.groovy.runtime.callsite.AbstractCallSite.call(AbstractCallSite.java:116)
        at org.jfrog.gradle.plugin.artifactory.extractor.listener.ProjectsEvaluatedBuildListener$_afterEvaluate_closure1.doCall(ProjectsEvaluatedBuildListener.groovy:50)
        at sun.reflect.NativeMethodAccessorImpl.invoke0(Native Method)
        at sun.reflect.NativeMethodAccessorImpl.invoke(NativeMethodAccessorImpl.java:57)
        at sun.reflect.DelegatingMethodAccessorImpl.invoke(DelegatingMethodAccessorImpl.java:43)
        at java.lang.reflect.Method.invoke(Method.java:606)
        at org.codehaus.groovy.reflection.CachedMethod.invoke(CachedMethod.java:90)
        at groovy.lang.MetaMethod.doMethodInvoke(MetaMethod.java:233)
        at org.codehaus.groovy.runtime.metaclass.ClosureMetaClass.invokeMethod(ClosureMetaClass.java:272)
        at groovy.lang.MetaClassImpl.invokeMethod(MetaClassImpl.java:877)
        at groovy.lang.Closure.call(Closure.java:412)
        at groovy.lang.Closure.call(Closure.java:425)
        at org.codehaus.groovy.runtime.DefaultGroovyMethods.each(DefaultGroovyMethods.java:1376)
        at org.codehaus.groovy.runtime.DefaultGroovyMethods.each(DefaultGroovyMethods.java:1348)
        at org.codehaus.groovy.runtime.dgm$162.invoke(Unknown Source)
        at org.codehaus.groovy.runtime.callsite.PojoMetaMethodSite$PojoMetaMethodSiteNoUnwrapNoCoerce.invoke(PojoMetaMethodSite.java:271)
        at org.codehaus.groovy.runtime.callsite.PojoMetaMethodSite.call(PojoMetaMethodSite.java:53)
        at org.codehaus.groovy.runtime.callsite.CallSiteArray.defaultCall(CallSiteArray.java:42)
        at org.codehaus.groovy.runtime.callsite.AbstractCallSite.call(AbstractCallSite.java:108)
        at org.codehaus.groovy.runtime.callsite.AbstractCallSite.call(AbstractCallSite.java:116)
        at org.jfrog.gradle.plugin.artifactory.extractor.listener.ProjectsEvaluatedBuildListener.afterEvaluate(ProjectsEvaluatedBuildListener.groovy:48)
        at sun.reflect.NativeMethodAccessorImpl.invoke0(Native Method)
        at sun.reflect.NativeMethodAccessorImpl.invoke(NativeMethodAccessorImpl.java:57)
        at sun.reflect.DelegatingMethodAccessorImpl.invoke(DelegatingMethodAccessorImpl.java:43)
        at java.lang.reflect.Method.invoke(Method.java:606)
        at org.gradle.messaging.dispatch.ReflectionDispatch.dispatch(ReflectionDispatch.java:35)
        at org.gradle.messaging.dispatch.ReflectionDispatch.dispatch(ReflectionDispatch.java:24)
        at org.gradle.listener.BroadcastDispatch.dispatch(BroadcastDispatch.java:81)
        ... 63 more

FAILURE: Build failed with an exception.

* Where:
Build file '/opt/bamboo-home/xml-data/build-dir/INTEXT-PRINT-JOB1/spring-integration-print/build.gradle' line: 81

* What went wrong:
A problem occurred evaluating root project 'spring-integration-print'.
> Could not resolve all dependencies for configuration ':jacoco'.
   > Could not resolve org.jacoco:org.jacoco.agent:0.5.6.201201232323.
     Required by:
         org.springframework.integration:spring-integration-print:1.0.0.BUILD-SNAPSHOT
      > Could not GET 'https://repo.springsource.org/libs-milestone/org/jacoco/org.jacoco.agent/0.5.6.201201232323/org.jacoco.agent-0.5.6.201201232323.pom'.
         > peer not authenticated
      > Could not GET 'https://repo.springsource.org/plugins-release/org/jacoco/org.jacoco.agent/0.5.6.201201232323/org.jacoco.agent-0.5.6.201201232323.pom'.
         > peer not authenticated

* Try:
Run with --stacktrace option to get the stack trace. Run with --info or --debug option to get more log output.