Build result summary

Details

Completed
Duration
12 seconds
Labels
None
Revision
306eec5f5e13f40a8e9299c8a9dc2146b70e0fa9 306eec5f5e13f40a8e9299c8a9dc2146b70e0fa9
Failing since
#25 (Changes by Spring Operator <spring-operator@users.noreply.github.com>)
No failed tests found, a possible compilation error occurred.

Responsible

This build has been failing since #25
No one has taken responsibility

Code commits

Author Commit Message Commit date
Spring Operator <spring-operator@users.noreply.github.com> Spring Operator <spring-operator@users.noreply.github.com> 306eec5f5e13f40a8e9299c8a9dc2146b70e0fa9 306eec5f5e13f40a8e9299c8a9dc2146b70e0fa9 URL Cleanup
This commit updates URLs to prefer the https protocol. Redirects are not followed to avoid accidentally expanding intentionally shortened URLs (i.e. if using a URL shortener).

# Fixed URLs

## Fixed Success
These URLs were switched to an https URL with a 2xx status. While the status was successful, your review is still recommended.

* [ ] http://www.apache.org/licenses/ with 12 occurrences migrated to:
  https://www.apache.org/licenses/ ([https](https://www.apache.org/licenses/) result 200).
* [ ] http://www.apache.org/licenses/LICENSE-2.0 with 345 occurrences migrated to:
  https://www.apache.org/licenses/LICENSE-2.0 ([https](https://www.apache.org/licenses/LICENSE-2.0) result 200).

Jira issues

IssueDescriptionStatus
Unknown Issue TypeLICENSE-2Could not obtain issue details from Jira

Error summary for Default Job

The job generated some errors, drill down into the full build log for more details.

Could not find test result reports in the /opt/bamboo-home/xml-data/build-dir/INTEXT-PRINT-JOB1 directory.
        at org.gradle.launcher.bootstrap.EntryPoint.run(EntryPoint.java:45)
        at org.gradle.launcher.Main.main(Main.java:39)
        at sun.reflect.NativeMethodAccessorImpl.invoke0(Native Method)
        at sun.reflect.NativeMethodAccessorImpl.invoke(NativeMethodAccessorImpl.java:57)
        at sun.reflect.DelegatingMethodAccessorImpl.invoke(DelegatingMethodAccessorImpl.java:43)
        at java.lang.reflect.Method.invoke(Method.java:606)
        at org.gradle.launcher.bootstrap.ProcessBootstrap.runNoExit(ProcessBootstrap.java:50)
        at org.gradle.launcher.bootstrap.ProcessBootstrap.run(ProcessBootstrap.java:32)
        at org.gradle.launcher.GradleMain.main(GradleMain.java:26)
        at sun.reflect.NativeMethodAccessorImpl.invoke0(Native Method)
        at sun.reflect.NativeMethodAccessorImpl.invoke(NativeMethodAccessorImpl.java:57)
        at sun.reflect.DelegatingMethodAccessorImpl.invoke(DelegatingMethodAccessorImpl.java:43)
        at java.lang.reflect.Method.invoke(Method.java:606)
        at org.gradle.wrapper.BootstrapMainStarter.start(BootstrapMainStarter.java:33)
        at org.gradle.wrapper.WrapperExecutor.execute(WrapperExecutor.java:130)
        at org.gradle.wrapper.GradleWrapperMain.main(GradleWrapperMain.java:48)
Caused by: org.gradle.listener.ListenerNotificationException: Failed to notify project evaluation listener.
        at org.gradle.listener.BroadcastDispatch.dispatch(BroadcastDispatch.java:90)
        at org.gradle.listener.BroadcastDispatch.dispatch(BroadcastDispatch.java:30)
        at org.gradle.messaging.dispatch.ProxyDispatchAdapter$DispatchingInvocationHandler.invoke(ProxyDispatchAdapter.java:93)
        at com.sun.proxy.$Proxy10.afterEvaluate(Unknown Source)
        at sun.reflect.NativeMethodAccessorImpl.invoke0(Native Method)
        at sun.reflect.NativeMethodAccessorImpl.invoke(NativeMethodAccessorImpl.java:57)
        at sun.reflect.DelegatingMethodAccessorImpl.invoke(DelegatingMethodAccessorImpl.java:43)
        at java.lang.reflect.Method.invoke(Method.java:606)
        at org.gradle.messaging.dispatch.ReflectionDispatch.dispatch(ReflectionDispatch.java:35)
        at org.gradle.messaging.dispatch.ReflectionDispatch.dispatch(ReflectionDispatch.java:24)
        at org.gradle.listener.BroadcastDispatch.dispatch(BroadcastDispatch.java:81)
        ... 41 more
Caused by: org.gradle.listener.ListenerNotificationException: Failed to notify project evaluation listener.
        at org.gradle.listener.BroadcastDispatch.dispatch(BroadcastDispatch.java:90)
        at org.gradle.listener.BroadcastDispatch.dispatch(BroadcastDispatch.java:30)
        at org.gradle.messaging.dispatch.ProxyDispatchAdapter$DispatchingInvocationHandler.invoke(ProxyDispatchAdapter.java:93)
        at com.sun.proxy.$Proxy10.afterEvaluate(Unknown Source)
        at sun.reflect.NativeMethodAccessorImpl.invoke0(Native Method)
        at sun.reflect.NativeMethodAccessorImpl.invoke(NativeMethodAccessorImpl.java:57)
        at sun.reflect.DelegatingMethodAccessorImpl.invoke(DelegatingMethodAccessorImpl.java:43)
        at java.lang.reflect.Method.invoke(Method.java:606)
        at org.gradle.messaging.dispatch.ReflectionDispatch.dispatch(ReflectionDispatch.java:35)
        at org.gradle.messaging.dispatch.ReflectionDispatch.dispatch(ReflectionDispatch.java:24)
        at org.gradle.listener.BroadcastDispatch.dispatch(BroadcastDispatch.java:81)
        ... 51 more
Caused by: org.gradle.listener.ListenerNotificationException: Failed to notify project evaluation listener.
        at org.gradle.listener.BroadcastDispatch.dispatch(BroadcastDispatch.java:90)
        at org.gradle.listener.BroadcastDispatch.dispatch(BroadcastDispatch.java:30)
        at org.gradle.listener.BroadcastDispatch.dispatch(BroadcastDispatch.java:81)
        ... 61 more
Caused by: java.lang.NoSuchMethodError: org.jfrog.gradle.plugin.artifactory.task.ArtifactoryTask.finalizedBy([Ljava/lang/Object;)Lorg/gradle/api/Task;
        at org.jfrog.gradle.plugin.artifactory.task.ArtifactoryTask.finalizeByDeployTask(ArtifactoryTask.java:235)
        at org.jfrog.gradle.plugin.artifactory.task.ArtifactoryTask$finalizeByDeployTask.call(Unknown Source)
        at org.codehaus.groovy.runtime.callsite.CallSiteArray.defaultCall(CallSiteArray.java:42)
        at org.codehaus.groovy.runtime.callsite.AbstractCallSite.call(AbstractCallSite.java:108)
        at org.codehaus.groovy.runtime.callsite.AbstractCallSite.call(AbstractCallSite.java:116)
        at org.jfrog.gradle.plugin.artifactory.extractor.listener.ProjectsEvaluatedBuildListener$_afterEvaluate_closure1.doCall(ProjectsEvaluatedBuildListener.groovy:50)
        at sun.reflect.NativeMethodAccessorImpl.invoke0(Native Method)
        at sun.reflect.NativeMethodAccessorImpl.invoke(NativeMethodAccessorImpl.java:57)
        at sun.reflect.DelegatingMethodAccessorImpl.invoke(DelegatingMethodAccessorImpl.java:43)
        at java.lang.reflect.Method.invoke(Method.java:606)
        at org.codehaus.groovy.reflection.CachedMethod.invoke(CachedMethod.java:90)
        at groovy.lang.MetaMethod.doMethodInvoke(MetaMethod.java:233)
        at org.codehaus.groovy.runtime.metaclass.ClosureMetaClass.invokeMethod(ClosureMetaClass.java:272)
        at groovy.lang.MetaClassImpl.invokeMethod(MetaClassImpl.java:877)
        at groovy.lang.Closure.call(Closure.java:412)
        at groovy.lang.Closure.call(Closure.java:425)
        at org.codehaus.groovy.runtime.DefaultGroovyMethods.each(DefaultGroovyMethods.java:1376)
        at org.codehaus.groovy.runtime.DefaultGroovyMethods.each(DefaultGroovyMethods.java:1348)
        at org.codehaus.groovy.runtime.dgm$162.invoke(Unknown Source)
        at org.codehaus.groovy.runtime.callsite.PojoMetaMethodSite$PojoMetaMethodSiteNoUnwrapNoCoerce.invoke(PojoMetaMethodSite.java:271)
        at org.codehaus.groovy.runtime.callsite.PojoMetaMethodSite.call(PojoMetaMethodSite.java:53)
        at org.codehaus.groovy.runtime.callsite.CallSiteArray.defaultCall(CallSiteArray.java:42)
        at org.codehaus.groovy.runtime.callsite.AbstractCallSite.call(AbstractCallSite.java:108)
        at org.codehaus.groovy.runtime.callsite.AbstractCallSite.call(AbstractCallSite.java:116)
        at org.jfrog.gradle.plugin.artifactory.extractor.listener.ProjectsEvaluatedBuildListener.afterEvaluate(ProjectsEvaluatedBuildListener.groovy:48)
        at sun.reflect.NativeMethodAccessorImpl.invoke0(Native Method)
        at sun.reflect.NativeMethodAccessorImpl.invoke(NativeMethodAccessorImpl.java:57)
        at sun.reflect.DelegatingMethodAccessorImpl.invoke(DelegatingMethodAccessorImpl.java:43)
        at java.lang.reflect.Method.invoke(Method.java:606)
        at org.gradle.messaging.dispatch.ReflectionDispatch.dispatch(ReflectionDispatch.java:35)
        at org.gradle.messaging.dispatch.ReflectionDispatch.dispatch(ReflectionDispatch.java:24)
        at org.gradle.listener.BroadcastDispatch.dispatch(BroadcastDispatch.java:81)
        ... 63 more

FAILURE: Build failed with an exception.

* Where:
Build file '/opt/bamboo-home/xml-data/build-dir/INTEXT-PRINT-JOB1/spring-integration-print/build.gradle' line: 81

* What went wrong:
A problem occurred evaluating root project 'spring-integration-print'.
> Could not resolve all dependencies for configuration ':jacoco'.
   > Could not resolve org.jacoco:org.jacoco.agent:0.5.6.201201232323.
     Required by:
         org.springframework.integration:spring-integration-print:1.0.0.BUILD-SNAPSHOT
      > Could not GET 'https://repo.springsource.org/libs-milestone/org/jacoco/org.jacoco.agent/0.5.6.201201232323/org.jacoco.agent-0.5.6.201201232323.pom'.
         > peer not authenticated
      > Could not GET 'https://repo.springsource.org/plugins-release/org/jacoco/org.jacoco.agent/0.5.6.201201232323/org.jacoco.agent-0.5.6.201201232323.pom'.
         > peer not authenticated

* Try:
Run with --stacktrace option to get the stack trace. Run with --info or --debug option to get more log output.