Build: #7 failed Changes by Spring Operator <[email protected]>

Build result summary

Details

Completed
Duration
43 seconds
Labels
None
Revision
dfe36d9fa42003c54e0470e4d102dafd1a00ff7f dfe36d9fa42003c54e0470e4d102dafd1a00ff7f
Total tests
34
Fixed in
#8 (Changes by Artem Bilan)

Tests

Responsible

No one has taken responsibility for this failure

Code commits

Author Commit Message Commit date
Spring Operator <spring-operator@users.noreply.github.com> Spring Operator <[email protected]> dfe36d9fa42003c54e0470e4d102dafd1a00ff7f dfe36d9fa42003c54e0470e4d102dafd1a00ff7f URL Cleanup
This commit updates URLs to prefer the https protocol. Redirects are not followed to avoid accidentally expanding intentionally shortened URLs (i.e. if using a URL shortener).

# Fixed URLs

## Fixed Success
These URLs were switched to an https URL with a 2xx status. While the status was successful, your review is still recommended.

* [ ] http://aws.amazon.com/ with 1 occurrences migrated to:
  https://aws.amazon.com/ ([https](https://aws.amazon.com/) result 200).
* [ ] http://aws.amazon.com/products/ with 3 occurrences migrated to:
  https://aws.amazon.com/products/ ([https](https://aws.amazon.com/products/) result 200).
* [ ] http://aws.amazon.com/ses/ with 2 occurrences migrated to:
  https://aws.amazon.com/ses/ ([https](https://aws.amazon.com/ses/) result 200).
* [ ] http://docs.aws.amazon.com/AWSSimpleQueueService/latest/SQSDeveloperGuide/sqs-long-polling.html with 1 occurrences migrated to:
  https://docs.aws.amazon.com/AWSSimpleQueueService/latest/SQSDeveloperGuide/sqs-long-polling.html ([https](https://docs.aws.amazon.com/AWSSimpleQueueService/latest/SQSDeveloperGuide/sqs-long-polling.html) result 200).
* [ ] http://docs.spring.io/spring-integration/reference/ with 1 occurrences migrated to:
  https://docs.spring.io/spring-integration/reference/ ([https](https://docs.spring.io/spring-integration/reference/) result 200).
* [ ] http://projects.spring.io/spring-integration/ with 1 occurrences migrated to:
  https://projects.spring.io/spring-integration/ ([https](https://projects.spring.io/spring-integration/) result 200).
* [ ] http://www.apache.org with 1 occurrences migrated to:
  https://www.apache.org ([https](https://www.apache.org) result 200).
* [ ] http://www.springframework.org/schema/integration/spring-integration.xsd with 1 occurrences migrated to:
  https://www.springframework.org/schema/integration/spring-integration.xsd ([https](https://www.springframework.org/schema/integration/spring-integration.xsd) result 200).
* [ ] http://aws.amazon.com/documentation/ses/ with 2 occurrences migrated to:
  https://aws.amazon.com/documentation/ses/ ([https](https://aws.amazon.com/documentation/ses/) result 301).
* [ ] http://aws.amazon.com/sdkforjava/ with 1 occurrences migrated to:
  https://aws.amazon.com/sdkforjava/ ([https](https://aws.amazon.com/sdkforjava/) result 301).
* [ ] http://contributor-covenant.org with 1 occurrences migrated to:
  https://contributor-covenant.org ([https](https://contributor-covenant.org) result 301).
* [ ] http://contributor-covenant.org/version/1/3/0/ with 1 occurrences migrated to:
  https://contributor-covenant.org/version/1/3/0/ ([https](https://contributor-covenant.org/version/1/3/0/) result 301).
* [ ] http://www.springframework.org with 1 occurrences migrated to:
  https://www.springframework.org ([https](https://www.springframework.org) result 301).

# Ignored
These URLs were intentionally ignored.

* http://localhost with 4 occurrences
* http://testQueue.amazonaws.com with 2 occurrences
* http://www.springframework.org/schema/beans with 1 occurrences
* http://www.springframework.org/schema/integration with 2 occurrences
* http://www.springframework.org/schema/integration/aws with 2 occurrences
* http://www.springframework.org/schema/tool with 2 occurrences
* http://www.w3.org/2001/XMLSchema with 1 occurrences
Spring Operator <spring-operator@users.noreply.github.com> Spring Operator <[email protected]> a41e1afba6dc19247ce6fc29b68fef0d97ab7ce1 a41e1afba6dc19247ce6fc29b68fef0d97ab7ce1 URL Cleanup
This commit updates URLs to prefer the https protocol. Redirects are not followed to avoid accidentally expanding intentionally shortened URLs (i.e. if using a URL shortener).

# Fixed URLs

## Fixed But Review Recommended
These URLs were fixed, but the https status was not OK. However, the https status was the same as the http request or http redirected to an https URL, so they were migrated. Your review is recommended.

* [ ] http://www.puppycrawl.com/dtds/configuration_1_2.dtd (404) with 1 occurrences migrated to:
  https://www.puppycrawl.com/dtds/configuration_1_2.dtd ([https](https://www.puppycrawl.com/dtds/configuration_1_2.dtd) result 404).
* [ ] http://www.puppycrawl.com/dtds/suppressions_1_1.dtd (404) with 1 occurrences migrated to:
  https://www.puppycrawl.com/dtds/suppressions_1_1.dtd ([https](https://www.puppycrawl.com/dtds/suppressions_1_1.dtd) result 404).
* [ ] http://www.springframework.org/schema/cloud/aws/messaging/spring-cloud-aws-messaging.xsd (404) with 7 occurrences migrated to:
  https://www.springframework.org/schema/cloud/aws/messaging/spring-cloud-aws-messaging.xsd ([https](https://www.springframework.org/schema/cloud/aws/messaging/spring-cloud-aws-messaging.xsd) result 404).

## Fixed Success
These URLs were switched to an https URL with a 2xx status. While the status was successful, your review is still recommended.

* [ ] http://www.springframework.org/schema/beans/spring-beans.xsd with 12 occurrences migrated to:
  https://www.springframework.org/schema/beans/spring-beans.xsd ([https](https://www.springframework.org/schema/beans/spring-beans.xsd) result 200).
* [ ] http://www.springframework.org/schema/integration/aws/spring-integration-aws.xsd with 12 occurrences migrated to:
  https://www.springframework.org/schema/integration/aws/spring-integration-aws.xsd ([https](https://www.springframework.org/schema/integration/aws/spring-integration-aws.xsd) result 200).
* [ ] http://www.springframework.org/schema/integration/spring-integration.xsd with 3 occurrences migrated to:
  https://www.springframework.org/schema/integration/spring-integration.xsd ([https](https://www.springframework.org/schema/integration/spring-integration.xsd) result 200).

# Ignored
These URLs were intentionally ignored.

* http://www.springframework.org/schema/beans with 24 occurrences
* http://www.springframework.org/schema/cloud/aws/messaging with 14 occurrences
* http://www.springframework.org/schema/integration with 6 occurrences
* http://www.springframework.org/schema/integration/aws with 24 occurrences
* http://www.w3.org/2001/XMLSchema-instance with 12 occurrences

Tests

New test failures 7
Status Test View job Duration
Collapse Failed S3InboundChannelAdapterParserTests testS3InboundChannelAdapterComplete History
Default Job < 1 sec
java.lang.IllegalStateException: java.lang.IllegalStateException: Failed to load ApplicationContext
java.lang.IllegalStateException: Failed to load ApplicationContext
	at org.springframework.test.context.cache.DefaultCacheAwareContextLoaderDelegate.loadContext(DefaultCacheAwareContextLoaderDelegate.java:124)
	at org.springframework.test.context.support.DefaultTestContext.getApplicationContext(DefaultTestContext.java:83)
	at org.springframework.test.context.support.DependencyInjectionTestExecutionListener.injectDependencies(DependencyInjectionTestExecutionListener.java:117)
	at org.springframework.test.context.support.DependencyInjectionTestExecutionListener.prepareTestInstance(DependencyInjectionTestExecutionListener.java:83)
	at org.springframework.test.context.TestContextManager.prepareTestInstance(TestContextManager.java:230)
	at org.springframework.test.context.junit4.SpringJUnit4ClassRunner.createTest(SpringJUnit4ClassRunner.java:228)
(94 more lines...)
Collapse Failed S3StreamingInboundChannelAdapterParserTests testS3StreamingInboundChannelAdapterComplete History
Default Job < 1 sec
java.lang.IllegalStateException: java.lang.IllegalStateException: Failed to load ApplicationContext
java.lang.IllegalStateException: Failed to load ApplicationContext
	at org.springframework.test.context.cache.DefaultCacheAwareContextLoaderDelegate.loadContext(DefaultCacheAwareContextLoaderDelegate.java:124)
	at org.springframework.test.context.support.DefaultTestContext.getApplicationContext(DefaultTestContext.java:83)
	at org.springframework.test.context.support.DependencyInjectionTestExecutionListener.injectDependencies(DependencyInjectionTestExecutionListener.java:117)
	at org.springframework.test.context.support.DependencyInjectionTestExecutionListener.prepareTestInstance(DependencyInjectionTestExecutionListener.java:83)
	at org.springframework.test.context.TestContextManager.prepareTestInstance(TestContextManager.java:230)
	at org.springframework.test.context.junit4.SpringJUnit4ClassRunner.createTest(SpringJUnit4ClassRunner.java:228)
(94 more lines...)
Collapse Failed SnsOutboundChannelAdapterParserTests testSnsOutboundChannelAdapterDefaultParser History
Default Job < 1 sec
java.lang.IllegalStateException: java.lang.IllegalStateException: Failed to load ApplicationContext
java.lang.IllegalStateException: Failed to load ApplicationContext
	at org.springframework.test.context.cache.DefaultCacheAwareContextLoaderDelegate.loadContext(DefaultCacheAwareContextLoaderDelegate.java:124)
	at org.springframework.test.context.support.DefaultTestContext.getApplicationContext(DefaultTestContext.java:83)
	at org.springframework.test.context.support.DependencyInjectionTestExecutionListener.injectDependencies(DependencyInjectionTestExecutionListener.java:117)
	at org.springframework.test.context.support.DependencyInjectionTestExecutionListener.prepareTestInstance(DependencyInjectionTestExecutionListener.java:83)
	at org.springframework.test.context.TestContextManager.prepareTestInstance(TestContextManager.java:230)
	at org.springframework.test.context.junit4.SpringJUnit4ClassRunner.createTest(SpringJUnit4ClassRunner.java:228)
(94 more lines...)
Collapse Failed SnsOutboundChannelAdapterParserTests testSnsOutboundGatewayParser History
Default Job < 1 sec
java.lang.IllegalStateException: java.lang.IllegalStateException: Failed to load ApplicationContext
java.lang.IllegalStateException: Failed to load ApplicationContext
	at org.springframework.test.context.cache.DefaultCacheAwareContextLoaderDelegate.loadContext(DefaultCacheAwareContextLoaderDelegate.java:124)
	at org.springframework.test.context.support.DefaultTestContext.getApplicationContext(DefaultTestContext.java:83)
	at org.springframework.test.context.support.DependencyInjectionTestExecutionListener.injectDependencies(DependencyInjectionTestExecutionListener.java:117)
	at org.springframework.test.context.support.DependencyInjectionTestExecutionListener.prepareTestInstance(DependencyInjectionTestExecutionListener.java:83)
	at org.springframework.test.context.TestContextManager.prepareTestInstance(TestContextManager.java:230)
	at org.springframework.test.context.junit4.SpringJUnit4ClassRunner.createTest(SpringJUnit4ClassRunner.java:228)
(94 more lines...)
Collapse Failed SqsMessageDrivenChannelAdapterParserTests testSqsMessageDrivenChannelAdapterParser History
Default Job < 1 sec
java.lang.IllegalStateException: java.lang.IllegalStateException: Failed to load ApplicationContext
java.lang.IllegalStateException: Failed to load ApplicationContext
	at org.springframework.test.context.cache.DefaultCacheAwareContextLoaderDelegate.loadContext(DefaultCacheAwareContextLoaderDelegate.java:124)
	at org.springframework.test.context.support.DefaultTestContext.getApplicationContext(DefaultTestContext.java:83)
	at org.springframework.test.context.support.DependencyInjectionTestExecutionListener.injectDependencies(DependencyInjectionTestExecutionListener.java:117)
	at org.springframework.test.context.support.DependencyInjectionTestExecutionListener.prepareTestInstance(DependencyInjectionTestExecutionListener.java:83)
	at org.springframework.test.context.TestContextManager.prepareTestInstance(TestContextManager.java:230)
	at org.springframework.test.context.junit4.SpringJUnit4ClassRunner.createTest(SpringJUnit4ClassRunner.java:228)
(83 more lines...)
Collapse Failed SqsMessageHandlerParserTests testSqsMessageHandlerParser History
Default Job < 1 sec
java.lang.IllegalStateException: java.lang.IllegalStateException: Failed to load ApplicationContext
java.lang.IllegalStateException: Failed to load ApplicationContext
	at org.springframework.test.context.cache.DefaultCacheAwareContextLoaderDelegate.loadContext(DefaultCacheAwareContextLoaderDelegate.java:124)
	at org.springframework.test.context.support.DefaultTestContext.getApplicationContext(DefaultTestContext.java:83)
	at org.springframework.test.context.support.DependencyInjectionTestExecutionListener.injectDependencies(DependencyInjectionTestExecutionListener.java:117)
	at org.springframework.test.context.support.DependencyInjectionTestExecutionListener.prepareTestInstance(DependencyInjectionTestExecutionListener.java:83)
	at org.springframework.test.context.TestContextManager.prepareTestInstance(TestContextManager.java:230)
	at org.springframework.test.context.junit4.SpringJUnit4ClassRunner.createTest(SpringJUnit4ClassRunner.java:228)
(83 more lines...)
Collapse Failed SqsOutboundChannelAdapterParserTests test_happy_path_with_queue_messaging_template History
Default Job < 1 sec
org.springframework.beans.factory.xml.XmlBeanDefinitionStoreException: org.springframework.beans.factory.xml.XmlBeanDefinitionStoreException: Line 10 in XML document from class path resource [org/springframework/integration/aws/config/xml/SqsOutboundChannelAdapterParserTests-context-good.xml] is invalid; nested exception is org.xml.sax.SAXParseException; lineNumber: 10; columnNumber: 44; cvc-complex-type.2.4.c: The matching wildcard is strict, but no declaration can be found for element 'aws-messaging:sqs-async-client'.
org.springframework.beans.factory.xml.XmlBeanDefinitionStoreException: Line 10 in XML document from class path resource [org/springframework/integration/aws/config/xml/SqsOutboundChannelAdapterParserTests-context-good.xml] is invalid; nested exception is org.xml.sax.SAXParseException; lineNumber: 10; columnNumber: 44; cvc-complex-type.2.4.c: The matching wildcard is strict, but no declaration can be found for element 'aws-messaging:sqs-async-client'.
	at org.springframework.beans.factory.xml.XmlBeanDefinitionReader.doLoadBeanDefinitions(XmlBeanDefinitionReader.java:399)
	at org.springframework.beans.factory.xml.XmlBeanDefinitionReader.loadBeanDefinitions(XmlBeanDefinitionReader.java:336)
	at org.springframework.beans.factory.xml.XmlBeanDefinitionReader.loadBeanDefinitions(XmlBeanDefinitionReader.java:304)
	at org.springframework.beans.factory.support.AbstractBeanDefinitionReader.loadBeanDefinitions(AbstractBeanDefinitionReader.java:181)
	at org.springframework.context.support.AbstractXmlApplicationContext.loadBeanDefinitions(AbstractXmlApplicationContext.java:123)
	at org.springframework.context.support.AbstractXmlApplicationContext.loadBeanDefinitions(AbstractXmlApplicationContext.java:93)
(77 more lines...)