Build: #7 failed Manual run by Artem Bilan

Build result summary

Details

Completed
Duration
55 seconds
Labels
None
Agent
bamboo-24.af.pivotal.io
Revision
3860df6e74c9cdc9d42cf5414ad1fe2b41f2b773 3860df6e74c9cdc9d42cf5414ad1fe2b41f2b773
Total tests
32
Fixed in
#8 (Changes by Artem Bilan)

Tests

Responsible

No one has taken responsibility for this failure

Tests

New test failures 1
Status Test View job Duration
Collapse Failed KinesisMessageDrivenChannelAdapterTests testKinesisMessageDrivenChannelAdapter History
Default Job 10 secs
org.awaitility.core.ConditionTimeoutException: org.awaitility.core.ConditionTimeoutException: Assertion condition defined as a lambda expression in org.springframework.integration.aws.inbound.KinesisMessageDrivenChannelAdapterTests that uses java.util.List 
Expected size:<0> but was:<1> in:
<[org.springframework.integration.aws.inbound.kinesis.KinesisMessageDrivenChannelAdapter$ConsumerInvoker@27f74007]> within 10 seconds.
org.awaitility.core.ConditionTimeoutException: Assertion condition defined as a lambda expression in org.springframework.integration.aws.inbound.KinesisMessageDrivenChannelAdapterTests that uses java.util.List 
Expected size:<0> but was:<1> in:
<[org.springframework.integration.aws.inbound.kinesis.KinesisMessageDrivenChannelAdapter$ConsumerInvoker@27f74007]> within 10 seconds.
	at org.awaitility.core.ConditionAwaiter.await(ConditionAwaiter.java:145)
	at org.awaitility.core.AssertionCondition.await(AssertionCondition.java:122)
(71 more lines...)