Build: #7 failed Manual run by Artem Bilan

Test results

  • 32 tests in total
  • 1 test failed
  • 1 failure is new
  • 11 seconds taken in total.
New test failures 1
Status Test View job Duration
Collapse Failed KinesisMessageDrivenChannelAdapterTests testKinesisMessageDrivenChannelAdapter History
Default Job 10 secs
org.awaitility.core.ConditionTimeoutException: org.awaitility.core.ConditionTimeoutException: Assertion condition defined as a lambda expression in org.springframework.integration.aws.inbound.KinesisMessageDrivenChannelAdapterTests that uses java.util.List 
Expected size:<0> but was:<1> in:
<[org.springframework.integration.aws.inbound.kinesis.KinesisMessageDrivenChannelAdapter$ConsumerInvoker@27f74007]> within 10 seconds.
org.awaitility.core.ConditionTimeoutException: Assertion condition defined as a lambda expression in org.springframework.integration.aws.inbound.KinesisMessageDrivenChannelAdapterTests that uses java.util.List 
Expected size:<0> but was:<1> in:
<[org.springframework.integration.aws.inbound.kinesis.KinesisMessageDrivenChannelAdapter$ConsumerInvoker@27f74007]> within 10 seconds.
	at org.awaitility.core.ConditionAwaiter.await(ConditionAwaiter.java:145)
	at org.awaitility.core.AssertionCondition.await(AssertionCondition.java:122)
(71 more lines...)