Build: #32 failed Changes by Artem Bilan

Logs

The following logs have been generated by the jobs in this plan.
  • Expand all
  • Collapse all
Job Logs
Collapse Default Job Default Stage Download or View
19-Jun-2020 16:01:35 CassandraOutboundAdapterIntegrationTests > testCassandraBatchInsertAndSelectStatement() FAILED
19-Jun-2020 16:01:35     org.springframework.beans.factory.UnsatisfiedDependencyException at AutowiredAnnotationBeanPostProcessor.java:643
19-Jun-2020 16:01:35         Caused by: org.springframework.beans.factory.NoSuchBeanDefinitionException at DefaultListableBeanFactory.java:1714
19-Jun-2020 16:01:35
19-Jun-2020 16:01:35 CassandraOutboundAdapterIntegrationTests > testCassandraBatchIngest() FAILED
19-Jun-2020 16:01:35     org.springframework.beans.factory.UnsatisfiedDependencyException at AutowiredAnnotationBeanPostProcessor.java:643
19-Jun-2020 16:01:35         Caused by: org.springframework.beans.factory.NoSuchBeanDefinitionException at DefaultListableBeanFactory.java:1714
19-Jun-2020 16:01:52
19-Jun-2020 16:01:52 19 tests completed, 4 failed
19-Jun-2020 16:01:52
19-Jun-2020 16:01:52 FAILURE: Build failed with an exception.
19-Jun-2020 16:01:52
19-Jun-2020 16:01:52 * What went wrong:
19-Jun-2020 16:01:52 Execution failed for task ':test'.
19-Jun-2020 16:01:52 > There were failing tests. See the report at: file:///opt/bamboo-home/xml-data/build-dir/INTEXT-SIC-JOB1/spring-integration-cassandra/build/reports/tests/test/index.html
19-Jun-2020 16:01:52
19-Jun-2020 16:01:52 * Try:
19-Jun-2020 16:01:52 Run with --stacktrace option to get the stack trace. Run with --info or --debug option to get more log output. Run with --scan to get full insights.
19-Jun-2020 16:01:52
19-Jun-2020 16:01:52 * Get more help at https://help.gradle.org
19-Jun-2020 16:01:52
19-Jun-2020 16:01:52 BUILD FAILED in 1m 33s
19-Jun-2020 16:01:52
19-Jun-2020 16:01:52 > Task :test FAILED
19-Jun-2020 16:01:52 12 actionable tasks: 11 executed, 1 up-to-date