Build: #32 failed

Job: Default Job failed

Stages & jobs

  1. Default Stage

Test results

  • 19 tests in total
  • 4 tests failed
  • 4 failures are new
  • < 1 second taken in total.

Build 32 has the following 4 errors: 4 new failure(s) occurred since the previous build.

New test failures 4
Status Test Duration
Collapse Failed CassandraOutboundAdapterIntegrationTests testBasicCassandraInsert() History
< 1 sec
org.springframework.beans.factory.UnsatisfiedDependencyException: org.springframework.beans.factory.UnsatisfiedDependencyException: Error creating bean with name 'org.springframework.integration.cassandra.config.CassandraOutboundAdapterIntegrationTests': Unsatisfied dependency expressed through field 'cassandraTemplate'; nested exception is org.springframework.beans.factory.NoSuchBeanDefinitionException: No qualifying bean of type 'org.springframework.data.cassandra.core.CassandraTemplate' available: expected at least 1 bean which qualifies as autowire candidate. Dependency annotations: {@org.springframework.beans.factory.annotation.Autowired(required=true)}
org.springframework.beans.factory.UnsatisfiedDependencyException: Error creating bean with name 'org.springframework.integration.cassandra.config.CassandraOutboundAdapterIntegrationTests': Unsatisfied dependency expressed through field 'cassandraTemplate'; nested exception is org.springframework.beans.factory.NoSuchBeanDefinitionException: No qualifying bean of type 'org.springframework.data.cassandra.core.CassandraTemplate' available: expected at least 1 bean which qualifies as autowire candidate. Dependency annotations: {@org.springframework.beans.factory.annotation.Autowired(required=true)}
	at org.springframework.beans.factory.annotation.AutowiredAnnotationBeanPostProcessor$AutowiredFieldElement.inject(AutowiredAnnotationBeanPostProcessor.java:643)
	at org.springframework.beans.factory.annotation.InjectionMetadata.inject(InjectionMetadata.java:130)
	at org.springframework.beans.factory.annotation.AutowiredAnnotationBeanPostProcessor.postProcessProperties(AutowiredAnnotationBeanPostProcessor.java:399)
	at org.springframework.beans.factory.support.AbstractAutowireCapableBeanFactory.populateBean(AbstractAutowireCapableBeanFactory.java:1422)
	at org.springframework.beans.factory.support.AbstractAutowireCapableBeanFactory.autowireBeanProperties(AbstractAutowireCapableBeanFactory.java:393)
	at org.springframework.test.context.support.DependencyInjectionTestExecutionListener.injectDependencies(DependencyInjectionTestExecutionListener.java:119)
(92 more lines...)
Collapse Failed CassandraOutboundAdapterIntegrationTests testCassandraBatchIngest() History
< 1 sec
org.springframework.beans.factory.UnsatisfiedDependencyException: org.springframework.beans.factory.UnsatisfiedDependencyException: Error creating bean with name 'org.springframework.integration.cassandra.config.CassandraOutboundAdapterIntegrationTests': Unsatisfied dependency expressed through field 'cassandraTemplate'; nested exception is org.springframework.beans.factory.NoSuchBeanDefinitionException: No qualifying bean of type 'org.springframework.data.cassandra.core.CassandraTemplate' available: expected at least 1 bean which qualifies as autowire candidate. Dependency annotations: {@org.springframework.beans.factory.annotation.Autowired(required=true)}
org.springframework.beans.factory.UnsatisfiedDependencyException: Error creating bean with name 'org.springframework.integration.cassandra.config.CassandraOutboundAdapterIntegrationTests': Unsatisfied dependency expressed through field 'cassandraTemplate'; nested exception is org.springframework.beans.factory.NoSuchBeanDefinitionException: No qualifying bean of type 'org.springframework.data.cassandra.core.CassandraTemplate' available: expected at least 1 bean which qualifies as autowire candidate. Dependency annotations: {@org.springframework.beans.factory.annotation.Autowired(required=true)}
	at org.springframework.beans.factory.annotation.AutowiredAnnotationBeanPostProcessor$AutowiredFieldElement.inject(AutowiredAnnotationBeanPostProcessor.java:643)
	at org.springframework.beans.factory.annotation.InjectionMetadata.inject(InjectionMetadata.java:130)
	at org.springframework.beans.factory.annotation.AutowiredAnnotationBeanPostProcessor.postProcessProperties(AutowiredAnnotationBeanPostProcessor.java:399)
	at org.springframework.beans.factory.support.AbstractAutowireCapableBeanFactory.populateBean(AbstractAutowireCapableBeanFactory.java:1422)
	at org.springframework.beans.factory.support.AbstractAutowireCapableBeanFactory.autowireBeanProperties(AbstractAutowireCapableBeanFactory.java:393)
	at org.springframework.test.context.support.DependencyInjectionTestExecutionListener.injectDependencies(DependencyInjectionTestExecutionListener.java:119)
(92 more lines...)
Collapse Failed CassandraOutboundAdapterIntegrationTests testCassandraBatchInsertAndSelectStatement() History
< 1 sec
org.springframework.beans.factory.UnsatisfiedDependencyException: org.springframework.beans.factory.UnsatisfiedDependencyException: Error creating bean with name 'org.springframework.integration.cassandra.config.CassandraOutboundAdapterIntegrationTests': Unsatisfied dependency expressed through field 'cassandraTemplate'; nested exception is org.springframework.beans.factory.NoSuchBeanDefinitionException: No qualifying bean of type 'org.springframework.data.cassandra.core.CassandraTemplate' available: expected at least 1 bean which qualifies as autowire candidate. Dependency annotations: {@org.springframework.beans.factory.annotation.Autowired(required=true)}
org.springframework.beans.factory.UnsatisfiedDependencyException: Error creating bean with name 'org.springframework.integration.cassandra.config.CassandraOutboundAdapterIntegrationTests': Unsatisfied dependency expressed through field 'cassandraTemplate'; nested exception is org.springframework.beans.factory.NoSuchBeanDefinitionException: No qualifying bean of type 'org.springframework.data.cassandra.core.CassandraTemplate' available: expected at least 1 bean which qualifies as autowire candidate. Dependency annotations: {@org.springframework.beans.factory.annotation.Autowired(required=true)}
	at org.springframework.beans.factory.annotation.AutowiredAnnotationBeanPostProcessor$AutowiredFieldElement.inject(AutowiredAnnotationBeanPostProcessor.java:643)
	at org.springframework.beans.factory.annotation.InjectionMetadata.inject(InjectionMetadata.java:130)
	at org.springframework.beans.factory.annotation.AutowiredAnnotationBeanPostProcessor.postProcessProperties(AutowiredAnnotationBeanPostProcessor.java:399)
	at org.springframework.beans.factory.support.AbstractAutowireCapableBeanFactory.populateBean(AbstractAutowireCapableBeanFactory.java:1422)
	at org.springframework.beans.factory.support.AbstractAutowireCapableBeanFactory.autowireBeanProperties(AbstractAutowireCapableBeanFactory.java:393)
	at org.springframework.test.context.support.DependencyInjectionTestExecutionListener.injectDependencies(DependencyInjectionTestExecutionListener.java:119)
(92 more lines...)
Collapse Failed CassandraOutboundAdapterIntegrationTests testExpressionTruncate() History
< 1 sec
org.springframework.beans.factory.UnsatisfiedDependencyException: org.springframework.beans.factory.UnsatisfiedDependencyException: Error creating bean with name 'org.springframework.integration.cassandra.config.CassandraOutboundAdapterIntegrationTests': Unsatisfied dependency expressed through field 'cassandraTemplate'; nested exception is org.springframework.beans.factory.NoSuchBeanDefinitionException: No qualifying bean of type 'org.springframework.data.cassandra.core.CassandraTemplate' available: expected at least 1 bean which qualifies as autowire candidate. Dependency annotations: {@org.springframework.beans.factory.annotation.Autowired(required=true)}
org.springframework.beans.factory.UnsatisfiedDependencyException: Error creating bean with name 'org.springframework.integration.cassandra.config.CassandraOutboundAdapterIntegrationTests': Unsatisfied dependency expressed through field 'cassandraTemplate'; nested exception is org.springframework.beans.factory.NoSuchBeanDefinitionException: No qualifying bean of type 'org.springframework.data.cassandra.core.CassandraTemplate' available: expected at least 1 bean which qualifies as autowire candidate. Dependency annotations: {@org.springframework.beans.factory.annotation.Autowired(required=true)}
	at org.springframework.beans.factory.annotation.AutowiredAnnotationBeanPostProcessor$AutowiredFieldElement.inject(AutowiredAnnotationBeanPostProcessor.java:643)
	at org.springframework.beans.factory.annotation.InjectionMetadata.inject(InjectionMetadata.java:130)
	at org.springframework.beans.factory.annotation.AutowiredAnnotationBeanPostProcessor.postProcessProperties(AutowiredAnnotationBeanPostProcessor.java:399)
	at org.springframework.beans.factory.support.AbstractAutowireCapableBeanFactory.populateBean(AbstractAutowireCapableBeanFactory.java:1422)
	at org.springframework.beans.factory.support.AbstractAutowireCapableBeanFactory.autowireBeanProperties(AbstractAutowireCapableBeanFactory.java:393)
	at org.springframework.test.context.support.DependencyInjectionTestExecutionListener.injectDependencies(DependencyInjectionTestExecutionListener.java:119)
(92 more lines...)