Build: #2 failed Manual run by Artem Bilan

Build result summary

Details

Completed
Duration
1 minute
Labels
None
Revision
4f4d90376c497bcea0f66586ac8c48158539e088 4f4d90376c497bcea0f66586ac8c48158539e088
Total tests
4
Fixed in
#3 (Manual run by Artem Bilan)

Tests

Responsible

No one has taken responsibility for this failure

Tests

New test failures 4
Status Test View job Duration
Collapse Failed EtcdTests testSimpleLeader History
Default Job 5 secs
java.lang.AssertionError: java.lang.AssertionError: 
Expected: is <true>
     but: was <false>
java.lang.AssertionError: 
Expected: is <true>
     but: was <false>
	at org.hamcrest.MatcherAssert.assertThat(MatcherAssert.java:20)
	at org.junit.Assert.assertThat(Assert.java:956)
(49 more lines...)
Collapse Failed EtcdTests testLeaderYield History
Default Job 5 secs
java.lang.AssertionError: java.lang.AssertionError: 
Expected: is <true>
     but: was <false>
java.lang.AssertionError: 
Expected: is <true>
     but: was <false>
	at org.hamcrest.MatcherAssert.assertThat(MatcherAssert.java:20)
	at org.junit.Assert.assertThat(Assert.java:956)
(49 more lines...)
Collapse Failed EtcdTests testBlockingThreadLeader History
Default Job 7 secs
java.lang.AssertionError: java.lang.AssertionError: 
Expected: is <true>
     but: was <false>
java.lang.AssertionError: 
Expected: is <true>
     but: was <false>
	at org.hamcrest.MatcherAssert.assertThat(MatcherAssert.java:20)
	at org.junit.Assert.assertThat(Assert.java:956)
(49 more lines...)
Collapse Failed EtcdTests testFailingCandidateGrantCallback History
Default Job 5 secs
java.lang.AssertionError: java.lang.AssertionError: 
Expected: is <true>
     but: was <false>
java.lang.AssertionError: 
Expected: is <true>
     but: was <false>
	at org.hamcrest.MatcherAssert.assertThat(MatcherAssert.java:20)
	at org.junit.Assert.assertThat(Assert.java:956)
(49 more lines...)