Build: #2 failed Manual run by Artem Bilan

Logs

The following logs have been generated by the jobs in this plan.
  • Expand all
  • Collapse all
Job Logs
Collapse Default Job Default Stage Download or View
15-Oct-2018 22:03:42     java.lang.AssertionError at EtcdTests.java:56
15-Oct-2018 22:03:47
15-Oct-2018 22:03:47 org.springframework.integration.etcd.leader.EtcdTests > testFailingCandidateGrantCallback FAILED
15-Oct-2018 22:03:47     java.lang.AssertionError at EtcdTests.java:95
15-Oct-2018 22:03:52
15-Oct-2018 22:03:52 org.springframework.integration.etcd.leader.EtcdTests > testLeaderYield FAILED
15-Oct-2018 22:03:52     java.lang.AssertionError at EtcdTests.java:67
15-Oct-2018 22:03:53
15-Oct-2018 22:03:53 4 tests completed, 4 failed
15-Oct-2018 22:03:53
15-Oct-2018 22:03:53 > Task :test FAILED
15-Oct-2018 22:03:53
15-Oct-2018 22:03:53 FAILURE: Build failed with an exception.
15-Oct-2018 22:03:53
15-Oct-2018 22:03:53 * What went wrong:
15-Oct-2018 22:03:53 Execution failed for task ':test'.
15-Oct-2018 22:03:53 > There were failing tests. See the report at: file:///opt/bamboo-home/xml-data/build-dir/INTEXT-SIETCD-JOB1/spring-integration-etcd/build/reports/tests/test/index.html
15-Oct-2018 22:03:53
15-Oct-2018 22:03:53 * Try:
15-Oct-2018 22:03:53 Run with --stacktrace option to get the stack trace. Run with --info or --debug option to get more log output. Run with --scan to get full insights.
15-Oct-2018 22:03:53
15-Oct-2018 22:03:53 * Get more help at https://help.gradle.org
15-Oct-2018 22:03:53
15-Oct-2018 22:03:53 BUILD FAILED in 1m 2s
15-Oct-2018 22:03:53 10 actionable tasks: 9 executed, 1 up-to-date