Build: #2 failed

Job: Default Job failed

Stages & jobs

  1. Default Stage

Job result summary

Completed
Duration
1 minute
Revision
4f4d90376c497bcea0f66586ac8c48158539e088 4f4d90376c497bcea0f66586ac8c48158539e088
Total tests
4
Fixed in
#3 (Manual run by Artem Bilan)

Tests

  • 4 tests in total
  • 4 tests failed
  • 4 failures are new
  • 22 seconds taken in total.
New test failures 4
Status Test Duration
Collapse Failed EtcdTests testBlockingThreadLeader History
7 secs
java.lang.AssertionError: java.lang.AssertionError: 
Expected: is <true>
     but: was <false>
java.lang.AssertionError: 
Expected: is <true>
     but: was <false>
	at org.hamcrest.MatcherAssert.assertThat(MatcherAssert.java:20)
	at org.junit.Assert.assertThat(Assert.java:956)
(49 more lines...)
Collapse Failed EtcdTests testFailingCandidateGrantCallback History
5 secs
java.lang.AssertionError: java.lang.AssertionError: 
Expected: is <true>
     but: was <false>
java.lang.AssertionError: 
Expected: is <true>
     but: was <false>
	at org.hamcrest.MatcherAssert.assertThat(MatcherAssert.java:20)
	at org.junit.Assert.assertThat(Assert.java:956)
(49 more lines...)
Collapse Failed EtcdTests testLeaderYield History
5 secs
java.lang.AssertionError: java.lang.AssertionError: 
Expected: is <true>
     but: was <false>
java.lang.AssertionError: 
Expected: is <true>
     but: was <false>
	at org.hamcrest.MatcherAssert.assertThat(MatcherAssert.java:20)
	at org.junit.Assert.assertThat(Assert.java:956)
(49 more lines...)
Collapse Failed EtcdTests testSimpleLeader History
5 secs
java.lang.AssertionError: java.lang.AssertionError: 
Expected: is <true>
     but: was <false>
java.lang.AssertionError: 
Expected: is <true>
     but: was <false>
	at org.hamcrest.MatcherAssert.assertThat(MatcherAssert.java:20)
	at org.junit.Assert.assertThat(Assert.java:956)
(49 more lines...)

Error summary

The build generated some errors. See the full build log for more details.


4 tests completed, 4 failed

FAILURE: Build failed with an exception.

* What went wrong:
Execution failed for task ':test'.
> There were failing tests. See the report at: file:///opt/bamboo-home/xml-data/build-dir/INTEXT-SIETCD-JOB1/spring-integration-etcd/build/reports/tests/test/index.html

* Try:
Run with --stacktrace option to get the stack trace. Run with --info or --debug option to get more log output. Run with --scan to get full insights.

* Get more help at https://help.gradle.org

BUILD FAILED in 1m 2s