Logs

The following logs have been generated by the jobs in this plan.
  • Expand all
  • Collapse all
Job Logs
Collapse Default Job Default Stage Download or View
06-Mar-2019 15:05:03 :processTestResources
06-Mar-2019 15:05:03 :testClasses
06-Mar-2019 15:05:03 :test UP-TO-DATE
06-Mar-2019 15:05:03 :check UP-TO-DATE
06-Mar-2019 15:05:03 :build
06-Mar-2019 15:05:03 :dist
06-Mar-2019 15:05:03 :install
06-Mar-2019 15:05:03 :artifactoryPublish
06-Mar-2019 15:05:03 :artifactoryDeploy
06-Mar-2019 15:05:03 Deploying artifact: https://repo.spring.io/libs-snapshot-local/org/springframework/integration/spring-integration-jt400/1.0.0-BUILD-SNAPSHOT/spring-integration-jt400-1.0.0-BUILD-SNAPSHOT-dist.zip
06-Mar-2019 15:05:04 :artifactoryDeploy FAILED
06-Mar-2019 15:05:04
06-Mar-2019 15:05:04 FAILURE: Build failed with an exception.
06-Mar-2019 15:05:04
06-Mar-2019 15:05:04 * What went wrong:
06-Mar-2019 15:05:04 Execution failed for task ':artifactoryDeploy'.
06-Mar-2019 15:05:04 > java.io.IOException: Failed to deploy file. Status code: 401 Response message: Artifactory returned the following errors:
06-Mar-2019 15:05:04   Unauthorized Status code: 401
06-Mar-2019 15:05:04
06-Mar-2019 15:05:04 * Try:
06-Mar-2019 15:05:04 Run with --stacktrace option to get the stack trace. Run with --info or --debug option to get more log output.
06-Mar-2019 15:05:04
06-Mar-2019 15:05:04 BUILD FAILED
06-Mar-2019 15:05:04
06-Mar-2019 15:05:04 Total time: 20.301 secs