Build: #13 failed

Job: Default Job failed

Stages & jobs

  1. Default Stage

Build log

The build generated 251 lines of output. Download or view full build log

26-Mar-2019 15:19:35 Build Spring Integration Extensions - Spring Integration Kafka (1.3.x) - Default Job #13 (INTEXT-SIK13-JOB1-13) started building on agent bamboo-03.af.pivotal.io
26-Mar-2019 15:19:35 Remote agent on host bamboo-03.af.pivotal.io
26-Mar-2019 15:19:35 Build working directory is /opt/bamboo-home/xml-data/build-dir/INTEXT-SIK13-JOB1
26-Mar-2019 15:19:35 Executing build Spring Integration Extensions - Spring Integration Kafka (1.3.x) - Default Job #13 (INTEXT-SIK13-JOB1-13)
26-Mar-2019 15:19:35 Starting task 'Checkout Default Repository' of type 'com.atlassian.bamboo.plugins.vcs:task.vcs.checkout'
26-Mar-2019 15:19:35 Build always requires a clean checkout
26-Mar-2019 15:19:35 Cleaning build directory '/opt/bamboo-home/xml-data/build-dir/INTEXT-SIK13-JOB1'
26-Mar-2019 15:19:35 Checking out into /opt/bamboo-home/xml-data/build-dir/INTEXT-SIK13-JOB1
26-Mar-2019 15:19:35 Updating source code to revision: 020975815be311dd3dc70c90e252723dc6812986
26-Mar-2019 15:19:35 Creating local git repository in '/opt/bamboo-home/xml-data/build-dir/INTEXT-SIK13-JOB1/.git'.
26-Mar-2019 15:19:35 Initialized empty Git repository in /opt/bamboo-home/xml-data/build-dir/INTEXT-SIK13-JOB1/.git/
26-Mar-2019 15:19:36 Fetching 'refs/heads/1.3.x' from 'https://github.com/spring-projects/spring-integration-kafka.git'.
26-Mar-2019 15:19:37 From https://github.com/spring-projects/spring-integration-kafka
26-Mar-2019 15:19:37 * [new branch]      1.3.x      -> 1.3.x
26-Mar-2019 15:19:37 * [new tag]         1.0.0.RELEASE -> 1.0.0.RELEASE
26-Mar-2019 15:19:37 * [new tag]         1.1.0.RELEASE -> 1.1.0.RELEASE
26-Mar-2019 15:19:37 * [new tag]         1.2.0.RELEASE -> 1.2.0.RELEASE
26-Mar-2019 15:19:37 * [new tag]         v1.0.0.M3  -> v1.0.0.M3
26-Mar-2019 15:19:37 * [new tag]         v1.0.0.RC1 -> v1.0.0.RC1
26-Mar-2019 15:19:37 * [new tag]         v1.1.1.RELEASE -> v1.1.1.RELEASE
26-Mar-2019 15:19:37 * [new tag]         v1.1.2.RELEASE -> v1.1.2.RELEASE
26-Mar-2019 15:19:37 * [new tag]         v1.2.0.M1  -> v1.2.0.M1
26-Mar-2019 15:19:37 * [new tag]         v1.2.0.RC1 -> v1.2.0.RC1
26-Mar-2019 15:19:37 * [new tag]         v1.2.0.RELEASE -> v1.2.0.RELEASE
26-Mar-2019 15:19:37 * [new tag]         v1.2.1.RELEASE -> v1.2.1.RELEASE
26-Mar-2019 15:19:37 * [new tag]         v1.3.0.RELEASE -> v1.3.0.RELEASE
26-Mar-2019 15:19:37 Checking out revision 020975815be311dd3dc70c90e252723dc6812986.
26-Mar-2019 15:19:37 Switched to branch '1.3.x'
26-Mar-2019 15:19:37 Updated source code to revision: 020975815be311dd3dc70c90e252723dc6812986
26-Mar-2019 15:19:37 Finished task 'Checkout Default Repository' with result: Success
26-Mar-2019 15:19:37 Running pre-build action: Artifactory Release Staging
26-Mar-2019 15:19:37 Running pre-build action: VCS Version Collector
26-Mar-2019 15:19:37 Starting task 'Artifactory Gradle' of type 'org.jfrog.bamboo.bamboo-artifactory-plugin:artifactoryGradleTask'
26-Mar-2019 15:19:37 Bamboo Artifactory Plugin version: 2.5.x-SNAPSHOT
26-Mar-2019 15:19:37
Beginning to execute external process for build 'Spring Integration Extensions - Spring Integration Kafka (1.3.x) - Default Job #13 (INTEXT-SIK13-JOB1-13)'
... running command line:
./gradlew clean build dist -I /tmp/artifactory.init.script6596063523084976047gradle -DbuildInfoConfig.propertiesFile=/tmp/buildinfo7745130467000432670properties artifactoryPublish -Dartifactory.resolve.password=******** -Dartifactory.publish.password=********
... in: /opt/bamboo-home/xml-data/build-dir/INTEXT-SIK13-JOB1
... using extra environment variables:
bamboo_planRepository_1_branch=1.3.x
IRBRC=/home/bamboo/.rvm/rubies/ruby-2.3.0/.irbrc
bamboo_********_username_password=********
bamboo_signing_store_password=********
bamboo_capability_system_builder_ant_Ant_1_9=/opt/ant-1.9
bamboo_capability_system_builder_ant_Ant_1_8=/opt/ant-1.8
bamboo_planRepository_1_branchDisplayName=1.3.x
bamboo_capability_system_jdk_OpenJDK_7u181=/opt/openjdk-7
bamboo_repository_revision_number=020975815be311dd3dc70c90e252723dc6812986
bamboo_capability_system_builder_node_Node_js_6=/usr/bin/node
bamboo_RIAK_BIN=/usr/sbin/riak
WRAPPER_BITS=32
bamboo_buildKey=INTEXT-SIK13-JOB1
rvm_loaded_flag=1
bamboo_bintray_password=********
bamboo_sonar_token_password=********
rvm_version=1.27.0 (latest)
PWD=/opt/bamboo-home/bin
bamboo_shortJobName=Default Job
bamboo_capability_system_builder_gradle___gradlew=./gradlew
bamboo_buildResultsUrl=https://build.spring.io/browse/INTEXT-SIK13-JOB1-13
bamboo_capability_system_builder_mvn3_Maven_3_3=/opt/maven-3.3
bamboo_capability_system_builder_mvn3_Maven_3_2=/opt/maven-3.2
bamboo_capability_system_builder_mvn3_Maven_3_1=/opt/maven-3.1
bamboo_planRepository_repositoryUrl=https://github.com/spring-projects/spring-integration-kafka.git
bamboo_agentId=208568326
bamboo_capability_system_builder_mvn3_Maven_3_5=/opt/maven-3.5
MY_RUBY_HOME=/home/bamboo/.rvm/rubies/ruby-2.3.0
bamboo_capability_system_builder_mvn3_Maven_3_0=/opt/maven-3.0
abilan=
rvm_path=/home/bamboo/.rvm
bamboo_planRepository_revision=020975815be311dd3dc70c90e252723dc6812986
bamboo_planRepository_previousRevision=0e34384b3c9040b174ea998edacf7266ef22126a
bamboo_capability_remote_build=true
bamboo_repository_branch_name=1.3.x
bamboo_repository_193953817_git_username=spring-buildmaster
bamboo_sonatype_token_password=********
SHLVL=1
bamboo_org_jfrog_bamboo_buildInfo_serverUrl=https://repo.spring.io
bamboo_scdf_acceptance_tests_password=********
WRAPPER_OS=linux
JAVA_HOME=/opt/jdk-7/
EC2_HOME=/opt/ec2-api-tools
XDG_SESSION_ID=c1
bamboo_capability_Agent=bamboo-03.af.pivotal.io
bamboo_planRepository_branch=1.3.x
bamboo_org_jfrog_bamboo_release_activated=false
bamboo_planRepository_1_type=gitv2
bamboo_planRepository_branchName=1.3.x
WRAPPER_FILE_SEPARATOR=/
_=/opt/bamboo-home/bin/bamboo-agent.sh
bamboo_repository_193953817_branch_name=1.3.x
WRAPPER_PATH_SEPARATOR=:
bamboo_sonar_password=********
bamboo_hg_cache_directory=/opt/bamboo-home/xml-data/build-dir/_hg-repositories-cache
bamboo_planRepository_1_username=spring-buildmaster
bamboo_planRepository_type=gitv2
bamboo_git_cache_directory=/opt/bamboo-home/xml-data/build-dir/_git-repositories-cache
bamboo_artifactory_username=buildmaster
rvm_stored_umask=0002
bamboo_tmp_directory=/opt/bamboo-home/temp
GEM_PATH=/home/bamboo/.rvm/gems/ruby-2.3.0:/home/bamboo/.rvm/gems/[email protected]
bamboo_planKey=INTEXT-SIK13
bamboo_planRepository_username=spring-buildmaster
bamboo_JDK8_HOME=/opt/jdk-8
bamboo_repository_193953817_name=Spring Integration Extensions
NLSPATH=/usr/dt/lib/nls/msg/%L/%N.cat
bamboo_planRepository_1_branchName=1.3.x
bamboo_sonar_version=5.6.3
XDG_DATA_DIRS=/usr/local/share:/usr/share:/var/lib/snapd/desktop
bamboo_capability_system_jdk_JDK_1_11=/opt/jdk-11
bamboo_resultsUrl=https://build.spring.io/browse/INTEXT-SIK13-JOB1-13
bamboo_capability_system_jdk_JDK_1_10=/opt/jdk-10
bamboo_build_working_directory=/opt/bamboo-home/xml-data/build-dir/INTEXT-SIK13-JOB1
bamboo_planRepository_1_name=Spring Integration Extensions
bamboo_capability_system_os=ubuntu1604
bamboo_repository_193953817_revision_number=020975815be311dd3dc70c90e252723dc6812986
bamboo_nexusPush_stagingProfile=buildmaster
bamboo_shortPlanName=Spring Integration Kafka (1.3.x)
MAIL=/var/mail/bamboo
bamboo_planRepository_name=Spring Integration Extensions
LOGNAME=bamboo
bamboo_repository_193953817_git_branch=1.3.x
bamboo_buildNumber=13
rvm_user_install_flag=1
SHELL=/bin/bash
bamboo_planName=Spring Integration Extensions - Spring Integration Kafka (1.3.x)
bamboo_JDK7_HOME=/opt/jdk-7
bamboo_shortPlanKey=SIK13
OLDPWD=/opt/users/bamboo
GEM_HOME=/home/bamboo/.rvm/gems/ruby-2.3.0
bamboo_shortJobKey=JOB1
bamboo_artifactory_password=********
bamboo_buildTimeStamp=2019-03-26T15:19:35.699Z
bamboo_repository_previous_revision_number=0e34384b3c9040b174ea998edacf7266ef22126a
RUBY_VERSION=ruby-2.3.0
bamboo_sonar_username=buildmaster
_system_name=Ubuntu
bamboo_********_password=********
bamboo_repository_git_branch=1.3.x
bamboo_buildResultKey=INTEXT-SIK13-JOB1-13
bamboo_nexusPush_close=true
bamboo_buildPlanName=Spring Integration Extensions - Spring Integration Kafka (1.3.x) - Default Job
bamboo_planRepository_1_revision=020975815be311dd3dc70c90e252723dc6812986
_system_arch=x86_64
bamboo_repository_name=Spring Integration Extensions
rvm_bin_path=/home/bamboo/.rvm/bin
bamboo_signing_key_password=********
XFILESEARCHPATH=/usr/dt/app-defaults/%L/Dt
rvm_prefix=/home/bamboo
LANG=en_US.UTF-8
bamboo_buildFailed=false
bamboo_capability_system_docker_executable=/usr/bin/docker
DISPLAY=localhost:1.0
bamboo_capability_system_builder_groovy_Groovy_2_4=/opt/groovy-2.4
bamboo_artifactory_password_mask_b=********
bamboo_capability_system_builder_command_Bash=/bin/bash
bamboo_artifactory_password_mask_a=********
bamboo_agentWorkingDirectory=/opt/bamboo-home/xml-data/build-dir
bamboo_capability_system_git_executable=/usr/bin/git
bamboo_repository_git_username=spring-buildmaster
bamboo_planRepository_1_previousRevision=0e34384b3c9040b174ea998edacf7266ef22126a
bamboo_capability_os_family=unix
NVM_NODEJS_ORG_MIRROR=http://nodejs.org/dist
bamboo_planRepository_branchDisplayName=1.3.x
NODE_PATH=/usr/lib/nodejs:/usr/lib/node_modules:/usr/share/javascript
bamboo_capability_system_builder_maven_Artifactory_Maven_3_5=/opt/maven-3.5
GIT_SSL_NO_VERIFY=true
bamboo_capability_system_builder_maven_Artifactory_Maven_3_3=/opt/maven-3.3
NVM_DIR=/home/bamboo/.nvm
bamboo_capability_system_builder_maven_Artifactory_Maven_3_2=/opt/maven-3.2
bamboo_s3_properties=/home/bamboo/tools/s3.properties
bamboo_capability_system_builder_maven_Artifactory_Maven_3_1=/opt/maven-3.1
bamboo_capability_system_builder_maven_Artifactory_Maven_3_0=/opt/maven-3.0
_system_type=Linux
bamboo_plan_storageTag=INTEXT-SIK13
bamboo_bintray_username_password=********
_system_version=16.04
USER=bamboo
bamboo_repository_git_repositoryUrl=https://github.com/spring-projects/spring-integration-kafka.git
bamboo_repository_193953817_git_repositoryUrl=https://github.com/spring-projects/spring-integration-kafka.git
bamboo_working_directory=/opt/bamboo-home/xml-data/build-dir/INTEXT-SIK13-JOB1
bamboo_org_jfrog_bamboo_buildInfo_activated=true
bamboo_planRepository_1_repositoryUrl=https://github.com/spring-projects/spring-integration-kafka.git
bamboo_capability_system_jdk_JDK_1_8=/opt/jdk-8
bamboo_capability_system_jdk_JDK_1_9=/opt/jdk-9
WRAPPER_ARCH=x86
bamboo_capability_system_jdk_JDK_1_6=/opt/jdk-6
bamboo_repository_193953817_previous_revision_number=0e34384b3c9040b174ea998edacf7266ef22126a
bamboo_sonatype_password=********
bamboo_capability_system_jdk_JDK_1_7=/opt/jdk-7
bamboo_sonar_ip=10.194.6.9
XDG_RUNTIME_DIR=/run/user/505
HOME=/home/bamboo
PATH=/bin:/home/bamboo/.rvm/gems/ruby-2.3.0/bin:/home/bamboo/.rvm/gems/[email protected]/bin:/home/bamboo/.rvm/rubies/ruby-2.3.0/bin:/home/bamboo/bin:/usr/local/bin:/usr/bin:/bin:/usr/local/games:/usr/games:/snap/bin:/home/bamboo/bin:/usr/local/bin:/opt/ec2-api-tools/bin:/home/bamboo/.rvm/bin:/bin:/home/bamboo/.rvm/gems/ruby-2.3.0/bin:/home/bamboo/.rvm/gems/[email protected]/bin:/home/bamboo/.rvm/rubies/ruby-2.3.0/bin:/home/bamboo/bin:/usr/local/bin:/usr/bin:/bin:/usr/local/games:/usr/games:/snap/bin:/home/bamboo/bin:/usr/local/bin:/opt/ec2-api-tools/bin:/home/bamboo/.rvm/bin
26-Mar-2019 15:19:37 Downloading http://services.gradle.org/distributions/gradle-2.5-all.zip
26-Mar-2019 15:19:39 ...................................................................................................................................................................................................................................................................................................................................................................................................................................................................................................................................................................................................................................................................................................................................................................................................................................................................................................................................................................................................................................................................................................................................................................................................................................................................................................................................................................................................................................................................................................................................................................................................................................................................................................................................................................................................................................................................................................................................................................................................................................................................................................................................................................................................................................................................................................................................................................................................................................................................................................................................................................................................................................................................................................................................................................................................................................................................................................................................................................................................................................................................................................................................................................................................................................................................................................................................................................................
26-Mar-2019 15:19:39 Unzipping /home/bamboo/.gradle/wrapper/dists/gradle-2.5-all/85d8dd968smc2gj7co7qe6akc/gradle-2.5-all.zip to /home/bamboo/.gradle/wrapper/dists/gradle-2.5-all/85d8dd968smc2gj7co7qe6akc
26-Mar-2019 15:19:40 Set executable permissions for: /home/bamboo/.gradle/wrapper/dists/gradle-2.5-all/85d8dd968smc2gj7co7qe6akc/gradle-2.5/bin/gradle
26-Mar-2019 15:19:45 Failed to notify ProjectEvaluationListener.afterEvaluate(), but primary configuration failure takes precedence.
26-Mar-2019 15:19:45 org.gradle.api.ProjectConfigurationException: A problem occurred configuring root project 'spring-integration-kafka'.
26-Mar-2019 15:19:45         at org.gradle.configuration.project.LifecycleProjectEvaluator.addConfigurationFailure(LifecycleProjectEvaluator.java:79)
26-Mar-2019 15:19:45         at org.gradle.configuration.project.LifecycleProjectEvaluator.evaluate(LifecycleProjectEvaluator.java:57)
26-Mar-2019 15:19:45         at org.gradle.api.internal.project.AbstractProject.evaluate(AbstractProject.java:488)
26-Mar-2019 15:19:45         at org.gradle.api.internal.project.AbstractProject.evaluate(AbstractProject.java:86)
26-Mar-2019 15:19:45         at org.gradle.execution.TaskPathProjectEvaluator.configureHierarchy(TaskPathProjectEvaluator.java:42)
26-Mar-2019 15:19:45         at org.gradle.configuration.DefaultBuildConfigurer.configure(DefaultBuildConfigurer.java:35)
26-Mar-2019 15:19:45         at org.gradle.initialization.DefaultGradleLauncher$4.run(DefaultGradleLauncher.java:143)
26-Mar-2019 15:19:45         at org.gradle.internal.Factories$1.create(Factories.java:22)
26-Mar-2019 15:19:45         at org.gradle.internal.progress.DefaultBuildOperationExecutor.run(DefaultBuildOperationExecutor.java:62)
26-Mar-2019 15:19:45         at org.gradle.internal.progress.DefaultBuildOperationExecutor.run(DefaultBuildOperationExecutor.java:47)
26-Mar-2019 15:19:45         at org.gradle.initialization.DefaultGradleLauncher.runBuildOperation(DefaultGradleLauncher.java:189)
26-Mar-2019 15:19:45         at org.gradle.initialization.DefaultGradleLauncher.doBuildStages(DefaultGradleLauncher.java:140)
26-Mar-2019 15:19:45         at org.gradle.initialization.DefaultGradleLauncher.access$200(DefaultGradleLauncher.java:35)
26-Mar-2019 15:19:45         at org.gradle.initialization.DefaultGradleLauncher$1.create(DefaultGradleLauncher.java:104)
26-Mar-2019 15:19:45         at org.gradle.initialization.DefaultGradleLauncher$1.create(DefaultGradleLauncher.java:97)
26-Mar-2019 15:19:45         at org.gradle.internal.progress.DefaultBuildOperationExecutor.run(DefaultBuildOperationExecutor.java:62)
26-Mar-2019 15:19:45         at org.gradle.initialization.DefaultGradleLauncher.runRootBuildOperation(DefaultGradleLauncher.java:184)
26-Mar-2019 15:19:45         at org.gradle.initialization.DefaultGradleLauncher.doBuild(DefaultGradleLauncher.java:97)
26-Mar-2019 15:19:45         at org.gradle.initialization.DefaultGradleLauncher.run(DefaultGradleLauncher.java:86)
26-Mar-2019 15:19:45         at org.gradle.launcher.exec.InProcessBuildActionExecuter$DefaultBuildController.run(InProcessBuildActionExecuter.java:93)
26-Mar-2019 15:19:45         at org.gradle.tooling.internal.provider.ExecuteBuildActionRunner.run(ExecuteBuildActionRunner.java:28)
26-Mar-2019 15:19:45         at org.gradle.launcher.exec.ChainingBuildActionRunner.run(ChainingBuildActionRunner.java:35)
26-Mar-2019 15:19:45         at org.gradle.launcher.exec.InProcessBuildActionExecuter.execute(InProcessBuildActionExecuter.java:43)
26-Mar-2019 15:19:45         at org.gradle.launcher.exec.InProcessBuildActionExecuter.execute(InProcessBuildActionExecuter.java:27)
26-Mar-2019 15:19:45         at org.gradle.launcher.exec.ContinuousBuildActionExecuter.execute(ContinuousBuildActionExecuter.java:72)
26-Mar-2019 15:19:45         at org.gradle.launcher.exec.ContinuousBuildActionExecuter.execute(ContinuousBuildActionExecuter.java:44)
26-Mar-2019 15:19:45         at org.gradle.launcher.exec.DaemonUsageSuggestingBuildActionExecuter.execute(DaemonUsageSuggestingBuildActionExecuter.java:50)
26-Mar-2019 15:19:45         at org.gradle.launcher.exec.DaemonUsageSuggestingBuildActionExecuter.execute(DaemonUsageSuggestingBuildActionExecuter.java:27)
26-Mar-2019 15:19:45         at org.gradle.launcher.cli.RunBuildAction.run(RunBuildAction.java:40)
26-Mar-2019 15:19:45         at org.gradle.internal.Actions$RunnableActionAdapter.execute(Actions.java:170)
26-Mar-2019 15:19:45         at org.gradle.launcher.cli.CommandLineActionFactory$ParseAndBuildAction.execute(CommandLineActionFactory.java:237)
26-Mar-2019 15:19:45         at org.gradle.launcher.cli.CommandLineActionFactory$ParseAndBuildAction.execute(CommandLineActionFactory.java:210)
26-Mar-2019 15:19:45         at org.gradle.launcher.cli.JavaRuntimeValidationAction.execute(JavaRuntimeValidationAction.java:35)
26-Mar-2019 15:19:45         at org.gradle.launcher.cli.JavaRuntimeValidationAction.execute(JavaRuntimeValidationAction.java:24)
26-Mar-2019 15:19:45         at org.gradle.launcher.cli.CommandLineActionFactory$WithLogging.execute(CommandLineActionFactory.java:206)
26-Mar-2019 15:19:45         at org.gradle.launcher.cli.CommandLineActionFactory$WithLogging.execute(CommandLineActionFactory.java:169)
26-Mar-2019 15:19:45         at org.gradle.launcher.cli.ExceptionReportingAction.execute(ExceptionReportingAction.java:33)
26-Mar-2019 15:19:45         at org.gradle.launcher.cli.ExceptionReportingAction.execute(ExceptionReportingAction.java:22)
26-Mar-2019 15:19:45         at org.gradle.launcher.Main.doAction(Main.java:33)
26-Mar-2019 15:19:45         at org.gradle.launcher.bootstrap.EntryPoint.run(EntryPoint.java:45)
26-Mar-2019 15:19:45         at sun.reflect.NativeMethodAccessorImpl.invoke0(Native Method)
26-Mar-2019 15:19:45         at sun.reflect.NativeMethodAccessorImpl.invoke(NativeMethodAccessorImpl.java:57)
26-Mar-2019 15:19:45         at sun.reflect.DelegatingMethodAccessorImpl.invoke(DelegatingMethodAccessorImpl.java:43)
26-Mar-2019 15:19:45         at java.lang.reflect.Method.invoke(Method.java:606)
26-Mar-2019 15:19:45         at org.gradle.launcher.bootstrap.ProcessBootstrap.runNoExit(ProcessBootstrap.java:54)
26-Mar-2019 15:19:45         at org.gradle.launcher.bootstrap.ProcessBootstrap.run(ProcessBootstrap.java:35)
26-Mar-2019 15:19:45         at org.gradle.launcher.GradleMain.main(GradleMain.java:23)
26-Mar-2019 15:19:45         at sun.reflect.NativeMethodAccessorImpl.invoke0(Native Method)
26-Mar-2019 15:19:45         at sun.reflect.NativeMethodAccessorImpl.invoke(NativeMethodAccessorImpl.java:57)
26-Mar-2019 15:19:45         at sun.reflect.DelegatingMethodAccessorImpl.invoke(DelegatingMethodAccessorImpl.java:43)
26-Mar-2019 15:19:45         at java.lang.reflect.Method.invoke(Method.java:606)
26-Mar-2019 15:19:45         at org.gradle.wrapper.BootstrapMainStarter.start(BootstrapMainStarter.java:30)
26-Mar-2019 15:19:45         at org.gradle.wrapper.WrapperExecutor.execute(WrapperExecutor.java:127)
26-Mar-2019 15:19:45         at org.gradle.wrapper.GradleWrapperMain.main(GradleWrapperMain.java:61)
26-Mar-2019 15:19:45 Caused by: org.gradle.api.artifacts.ResolveException: Could not resolve all dependencies for configuration ':classpath'.
26-Mar-2019 15:19:45         at org.gradle.api.internal.artifacts.ivyservice.DefaultLenientConfiguration.rethrowFailure(DefaultLenientConfiguration.java:63)
26-Mar-2019 15:19:45         at org.gradle.api.internal.artifacts.ivyservice.DefaultResolvedConfiguration.rethrowFailure(DefaultResolvedConfiguration.java:36)
26-Mar-2019 15:19:45         at org.gradle.api.internal.artifacts.ivyservice.SelfResolvingDependencyResolver$FilesAggregatingResolvedConfiguration.rethrowFailure(SelfResolvingDependencyResolver.java:115)
26-Mar-2019 15:19:45         at org.gradle.api.internal.artifacts.ivyservice.ErrorHandlingArtifactDependencyResolver$ErrorHandlingResolvedConfiguration.rethrowFailure(ErrorHandlingArtifactDependencyResolver.java:191)
26-Mar-2019 15:19:45         at org.gradle.api.internal.artifacts.configurations.DefaultConfiguration$ConfigurationFileCollection.getFiles(DefaultConfiguration.java:674)
26-Mar-2019 15:19:45         at org.gradle.api.internal.artifacts.configurations.DefaultConfiguration.getFiles(DefaultConfiguration.java:284)
26-Mar-2019 15:19:45         at org.gradle.api.internal.artifacts.configurations.DefaultConfiguration_Decorated.getFiles(Unknown Source)
26-Mar-2019 15:19:45         at org.gradle.api.internal.initialization.DefaultScriptHandler.getScriptClassPath(DefaultScriptHandler.java:70)
26-Mar-2019 15:19:45         at org.gradle.plugin.use.internal.DefaultPluginRequestApplicator.defineScriptHandlerClassScope(DefaultPluginRequestApplicator.java:141)
26-Mar-2019 15:19:45         at org.gradle.plugin.use.internal.DefaultPluginRequestApplicator.applyPlugins(DefaultPluginRequestApplicator.java:54)
26-Mar-2019 15:19:45         at org.gradle.configuration.DefaultScriptPluginFactory$ScriptPluginImpl.apply(DefaultScriptPluginFactory.java:129)
26-Mar-2019 15:19:45         at org.gradle.configuration.project.BuildScriptProcessor.execute(BuildScriptProcessor.java:39)
26-Mar-2019 15:19:45         at org.gradle.configuration.project.BuildScriptProcessor.execute(BuildScriptProcessor.java:26)
26-Mar-2019 15:19:45         at org.gradle.configuration.project.ConfigureActionsProjectEvaluator.evaluate(ConfigureActionsProjectEvaluator.java:34)
26-Mar-2019 15:19:45         at org.gradle.configuration.project.LifecycleProjectEvaluator.evaluate(LifecycleProjectEvaluator.java:55)
26-Mar-2019 15:19:45         ... 52 more
26-Mar-2019 15:19:45 Caused by: org.gradle.internal.resolve.ModuleVersionResolveException: Could not resolve io.spring.gradle:spring-io-plugin:0.0.4.RELEASE.
26-Mar-2019 15:19:45 Required by:
26-Mar-2019 15:19:45     :spring-integration-kafka:1.3.2.BUILD-SNAPSHOT
26-Mar-2019 15:19:45         at org.gradle.api.internal.artifacts.ivyservice.ivyresolve.RepositoryChainComponentMetaDataResolver.resolveModule(RepositoryChainComponentMetaDataResolver.java:83)
26-Mar-2019 15:19:45         at org.gradle.api.internal.artifacts.ivyservice.ivyresolve.RepositoryChainComponentMetaDataResolver.resolve(RepositoryChainComponentMetaDataResolver.java:59)
26-Mar-2019 15:19:45         at org.gradle.api.internal.artifacts.ivyservice.clientmodule.ClientModuleResolver.resolve(ClientModuleResolver.java:44)
26-Mar-2019 15:19:45         at org.gradle.api.internal.artifacts.ivyservice.projectmodule.ProjectDependencyResolver.resolve(ProjectDependencyResolver.java:72)
26-Mar-2019 15:19:45         at org.gradle.api.internal.artifacts.ivyservice.resolveengine.graph.DependencyGraphBuilder$ModuleVersionResolveState.resolve(DependencyGraphBuilder.java:575)
26-Mar-2019 15:19:45         at org.gradle.api.internal.artifacts.ivyservice.resolveengine.graph.DependencyGraphBuilder$ModuleVersionResolveState.getMetaData(DependencyGraphBuilder.java:585)
26-Mar-2019 15:19:45         at org.gradle.api.internal.artifacts.ivyservice.resolveengine.graph.DependencyGraphBuilder$DependencyEdge.calculateTargetConfigurations(DependencyGraphBuilder.java:270)
26-Mar-2019 15:19:45         at org.gradle.api.internal.artifacts.ivyservice.resolveengine.graph.DependencyGraphBuilder$DependencyEdge.attachToTargetConfigurations(DependencyGraphBuilder.java:244)
26-Mar-2019 15:19:45         at org.gradle.api.internal.artifacts.ivyservice.resolveengine.graph.DependencyGraphBuilder.traverseGraph(DependencyGraphBuilder.java:156)
26-Mar-2019 15:19:45         at org.gradle.api.internal.artifacts.ivyservice.resolveengine.graph.DependencyGraphBuilder.resolveDependencyGraph(DependencyGraphBuilder.java:94)
26-Mar-2019 15:19:45         at org.gradle.api.internal.artifacts.ivyservice.resolveengine.graph.DependencyGraphBuilder.resolve(DependencyGraphBuilder.java:84)
26-Mar-2019 15:19:45         at org.gradle.api.internal.artifacts.ivyservice.resolveengine.DefaultDependencyResolver$1.execute(DefaultDependencyResolver.java:142)
26-Mar-2019 15:19:45         at org.gradle.api.internal.artifacts.ivyservice.resolveengine.DefaultDependencyResolver$1.execute(DefaultDependencyResolver.java:96)
26-Mar-2019 15:19:45         at org.gradle.internal.Transformers$4.transform(Transformers.java:137)
26-Mar-2019 15:19:45         at org.gradle.api.internal.artifacts.ivyservice.DefaultIvyContextManager.withIvy(DefaultIvyContextManager.java:61)
26-Mar-2019 15:19:45         at org.gradle.api.internal.artifacts.ivyservice.DefaultIvyContextManager.withIvy(DefaultIvyContextManager.java:39)
26-Mar-2019 15:19:45         at org.gradle.api.internal.artifacts.ivyservice.resolveengine.DefaultDependencyResolver.resolve(DefaultDependencyResolver.java:96)
26-Mar-2019 15:19:45         at org.gradle.api.internal.artifacts.ivyservice.CacheLockingArtifactDependencyResolver$1.run(CacheLockingArtifactDependencyResolver.java:42)
26-Mar-2019 15:19:45         at org.gradle.internal.Factories$1.create(Factories.java:22)
26-Mar-2019 15:19:45         at org.gradle.cache.internal.DefaultCacheAccess.useCache(DefaultCacheAccess.java:192)
26-Mar-2019 15:19:45         at org.gradle.cache.internal.DefaultCacheAccess.useCache(DefaultCacheAccess.java:175)
26-Mar-2019 15:19:45         at org.gradle.cache.internal.DefaultPersistentDirectoryStore.useCache(DefaultPersistentDirectoryStore.java:106)
26-Mar-2019 15:19:45         at org.gradle.cache.internal.DefaultCacheFactory$ReferenceTrackingCache.useCache(DefaultCacheFactory.java:187)
26-Mar-2019 15:19:45         at org.gradle.api.internal.artifacts.ivyservice.DefaultCacheLockingManager.useCache(DefaultCacheLockingManager.java:64)
26-Mar-2019 15:19:45         at org.gradle.api.internal.artifacts.ivyservice.CacheLockingArtifactDependencyResolver.resolve(CacheLockingArtifactDependencyResolver.java:40)
26-Mar-2019 15:19:45         at org.gradle.api.internal.artifacts.ivyservice.SelfResolvingDependencyResolver.resolve(SelfResolvingDependencyResolver.java:41)
26-Mar-2019 15:19:45         at org.gradle.api.internal.artifacts.ivyservice.ShortcircuitEmptyConfigsArtifactDependencyResolver.resolve(ShortcircuitEmptyConfigsArtifactDependencyResolver.java:56)
26-Mar-2019 15:19:45         at org.gradle.api.internal.artifacts.ivyservice.ErrorHandlingArtifactDependencyResolver.resolve(ErrorHandlingArtifactDependencyResolver.java:46)
26-Mar-2019 15:19:45         at org.gradle.api.internal.artifacts.ivyservice.DefaultConfigurationResolver.resolve(DefaultConfigurationResolver.java:45)
26-Mar-2019 15:19:45         at org.gradle.api.internal.artifacts.configurations.DefaultConfiguration.resolveGraphIfRequired(DefaultConfiguration.java:363)
26-Mar-2019 15:19:45         at org.gradle.api.internal.artifacts.configurations.DefaultConfiguration.resolveNow(DefaultConfiguration.java:338)
26-Mar-2019 15:19:45         at org.gradle.api.internal.artifacts.configurations.DefaultConfiguration.getResolvedConfiguration(DefaultConfiguration.java:331)
26-Mar-2019 15:19:45         at org.gradle.api.internal.artifacts.configurations.DefaultConfiguration_Decorated.getResolvedConfiguration(Unknown Source)
26-Mar-2019 15:19:45         at org.gradle.api.internal.artifacts.configurations.DefaultConfiguration$ConfigurationFileCollection.getFiles(DefaultConfiguration.java:672)
26-Mar-2019 15:19:45         ... 62 more
26-Mar-2019 15:19:45 Caused by: org.gradle.internal.resolve.ModuleVersionResolveException: Could not resolve io.spring.gradle:spring-io-plugin:0.0.4.RELEASE.
26-Mar-2019 15:19:45         at org.gradle.api.internal.artifacts.ivyservice.ivyresolve.ErrorHandlingModuleComponentRepository$ErrorHandlingModuleComponentRepositoryAccess.resolveComponentMetaData(ErrorHandlingModuleComponentRepository.java:91)
26-Mar-2019 15:19:45         at org.gradle.api.internal.artifacts.ivyservice.ivyresolve.ComponentMetaDataResolveState.process(ComponentMetaDataResolveState.java:66)
26-Mar-2019 15:19:45         at org.gradle.api.internal.artifacts.ivyservice.ivyresolve.ComponentMetaDataResolveState.resolve(ComponentMetaDataResolveState.java:58)
26-Mar-2019 15:19:45         at org.gradle.api.internal.artifacts.ivyservice.ivyresolve.RepositoryChainComponentMetaDataResolver.findBestMatch(RepositoryChainComponentMetaDataResolver.java:116)
26-Mar-2019 15:19:45         at org.gradle.api.internal.artifacts.ivyservice.ivyresolve.RepositoryChainComponentMetaDataResolver.findBestMatch(RepositoryChainComponentMetaDataResolver.java:99)
26-Mar-2019 15:19:45         at org.gradle.api.internal.artifacts.ivyservice.ivyresolve.RepositoryChainComponentMetaDataResolver.resolveModule(RepositoryChainComponentMetaDataResolver.java:72)
26-Mar-2019 15:19:45         ... 95 more
26-Mar-2019 15:19:45 Caused by: org.gradle.internal.resource.ResourceException: Could not get resource 'https://repo.spring.io/plugins-release/io/spring/gradle/spring-io-plugin/0.0.4.RELEASE/spring-io-plugin-0.0.4.RELEASE.pom'.
26-Mar-2019 15:19:45         at org.gradle.internal.resource.ResourceException.failure(ResourceException.java:61)
26-Mar-2019 15:19:45         at org.gradle.api.internal.artifacts.repositories.resolver.DefaultExternalResourceArtifactResolver.downloadStaticResource(DefaultExternalResourceArtifactResolver.java:99)
26-Mar-2019 15:19:45         at org.gradle.api.internal.artifacts.repositories.resolver.DefaultExternalResourceArtifactResolver.resolveMetaDataArtifact(DefaultExternalResourceArtifactResolver.java:56)
26-Mar-2019 15:19:45         at org.gradle.api.internal.artifacts.repositories.resolver.ExternalResourceResolver.parseMetaDataFromArtifact(ExternalResourceResolver.java:168)
26-Mar-2019 15:19:45         at org.gradle.api.internal.artifacts.repositories.resolver.ExternalResourceResolver.resolveStaticDependency(ExternalResourceResolver.java:147)
26-Mar-2019 15:19:45         at org.gradle.api.internal.artifacts.repositories.resolver.MavenResolver.doResolveComponentMetaData(MavenResolver.java:93)
26-Mar-2019 15:19:45         at org.gradle.api.internal.artifacts.repositories.resolver.ExternalResourceResolver$RemoteRepositoryAccess.resolveComponentMetaData(ExternalResourceResolver.java:412)
26-Mar-2019 15:19:45         at org.gradle.api.internal.artifacts.ivyservice.ivyresolve.CacheLockReleasingModuleComponentsRepository$LockReleasingRepositoryAccess$2.run(CacheLockReleasingModuleComponentsRepository.java:71)
26-Mar-2019 15:19:45         at org.gradle.internal.Factories$1.create(Factories.java:22)
26-Mar-2019 15:19:45         at org.gradle.cache.internal.DefaultCacheAccess.longRunningOperation(DefaultCacheAccess.java:242)
26-Mar-2019 15:19:45         at org.gradle.cache.internal.DefaultCacheAccess.longRunningOperation(DefaultCacheAccess.java:313)
26-Mar-2019 15:19:45         at org.gradle.cache.internal.DefaultPersistentDirectoryStore.longRunningOperation(DefaultPersistentDirectoryStore.java:114)
26-Mar-2019 15:19:45         at org.gradle.cache.internal.DefaultCacheFactory$ReferenceTrackingCache.longRunningOperation(DefaultCacheFactory.java:179)
26-Mar-2019 15:19:45         at org.gradle.api.internal.artifacts.ivyservice.DefaultCacheLockingManager.longRunningOperation(DefaultCacheLockingManager.java:56)
26-Mar-2019 15:19:45         at org.gradle.api.internal.artifacts.ivyservice.ivyresolve.CacheLockReleasingModuleComponentsRepository$LockReleasingRepositoryAccess.resolveComponentMetaData(CacheLockReleasingModuleComponentsRepository.java:69)
26-Mar-2019 15:19:45         at org.gradle.api.internal.artifacts.ivyservice.ivyresolve.CachingModuleComponentRepository$ResolveAndCacheRepositoryAccess.resolveComponentMetaData(CachingModuleComponentRepository.java:297)
26-Mar-2019 15:19:45         at org.gradle.api.internal.artifacts.ivyservice.ivyresolve.BaseModuleComponentRepositoryAccess.resolveComponentMetaData(BaseModuleComponentRepositoryAccess.java:42)
26-Mar-2019 15:19:45         at org.gradle.api.internal.artifacts.ivyservice.ivyresolve.memcache.InMemoryCachedModuleComponentRepository$CachedAccess.resolveComponentMetaData(InMemoryCachedModuleComponentRepository.java:76)
26-Mar-2019 15:19:45         at org.gradle.api.internal.artifacts.ivyservice.ivyresolve.ErrorHandlingModuleComponentRepository$ErrorHandlingModuleComponentRepositoryAccess.resolveComponentMetaData(ErrorHandlingModuleComponentRepository.java:89)
26-Mar-2019 15:19:45         ... 100 more
26-Mar-2019 15:19:45 Caused by: org.gradle.internal.resource.transport.http.HttpRequestException: Could not HEAD 'https://repo.spring.io/plugins-release/io/spring/gradle/spring-io-plugin/0.0.4.RELEASE/spring-io-plugin-0.0.4.RELEASE.pom'.
26-Mar-2019 15:19:45         at org.gradle.internal.resource.transport.http.HttpClientHelper.performRequest(HttpClientHelper.java:83)
26-Mar-2019 15:19:45         at org.gradle.internal.resource.transport.http.HttpClientHelper.performRawHead(HttpClientHelper.java:61)
26-Mar-2019 15:19:45         at org.gradle.internal.resource.transport.http.HttpClientHelper.performHead(HttpClientHelper.java:65)
26-Mar-2019 15:19:45         at org.gradle.internal.resource.transport.http.HttpResourceAccessor.getMetaData(HttpResourceAccessor.java:85)
26-Mar-2019 15:19:45         at org.gradle.internal.resource.transfer.DefaultExternalResourceConnector.getMetaData(DefaultExternalResourceConnector.java:47)
26-Mar-2019 15:19:45         at org.gradle.internal.resource.transport.DefaultExternalResourceRepository.getResourceMetaData(DefaultExternalResourceRepository.java:68)
26-Mar-2019 15:19:45         at org.gradle.internal.resource.transfer.DefaultCacheAwareExternalResourceAccessor.getResource(DefaultCacheAwareExternalResourceAccessor.java:84)
26-Mar-2019 15:19:45         at org.gradle.api.internal.artifacts.repositories.resolver.DefaultExternalResourceArtifactResolver.downloadStaticResource(DefaultExternalResourceArtifactResolver.java:90)
26-Mar-2019 15:19:45         ... 117 more
26-Mar-2019 15:19:45 Caused by: javax.net.ssl.SSLPeerUnverifiedException: peer not authenticated
26-Mar-2019 15:19:45         at sun.security.ssl.SSLSessionImpl.getPeerCertificates(SSLSessionImpl.java:421)
26-Mar-2019 15:19:45         at org.apache.http.conn.ssl.AbstractVerifier.verify(AbstractVerifier.java:128)
26-Mar-2019 15:19:45         at org.apache.http.conn.ssl.SSLSocketFactory.connectSocket(SSLSocketFactory.java:572)
26-Mar-2019 15:19:45         at org.apache.http.impl.conn.DefaultClientConnectionOperator.openConnection(DefaultClientConnectionOperator.java:180)
26-Mar-2019 15:19:45         at org.apache.http.impl.conn.ManagedClientConnectionImpl.open(ManagedClientConnectionImpl.java:294)
26-Mar-2019 15:19:45         at org.apache.http.impl.client.DefaultRequestDirector.tryConnect(DefaultRequestDirector.java:640)
26-Mar-2019 15:19:45         at org.apache.http.impl.client.DefaultRequestDirector.execute(DefaultRequestDirector.java:479)
26-Mar-2019 15:19:45         at org.apache.http.impl.client.AbstractHttpClient.execute(AbstractHttpClient.java:906)
26-Mar-2019 15:19:45         at org.apache.http.impl.client.DecompressingHttpClient.execute(DecompressingHttpClient.java:137)
26-Mar-2019 15:19:45         at org.apache.http.impl.client.DecompressingHttpClient.execute(DecompressingHttpClient.java:118)
26-Mar-2019 15:19:45         at org.gradle.internal.resource.transport.http.HttpClientHelper.performHttpRequest(HttpClientHelper.java:113)
26-Mar-2019 15:19:45         at org.gradle.internal.resource.transport.http.HttpClientHelper.executeGetOrHead(HttpClientHelper.java:90)
26-Mar-2019 15:19:45         at org.gradle.internal.resource.transport.http.HttpClientHelper.performRequest(HttpClientHelper.java:81)
26-Mar-2019 15:19:45         ... 124 more
26-Mar-2019 15:19:45
26-Mar-2019 15:19:45 FAILURE: Build failed with an exception.
26-Mar-2019 15:19:45
26-Mar-2019 15:19:45 * What went wrong:
26-Mar-2019 15:19:45 A problem occurred configuring root project 'spring-integration-kafka'.
26-Mar-2019 15:19:45 > Could not resolve all dependencies for configuration ':classpath'.
26-Mar-2019 15:19:45    > Could not resolve io.spring.gradle:spring-io-plugin:0.0.4.RELEASE.
26-Mar-2019 15:19:45      Required by:
26-Mar-2019 15:19:45          :spring-integration-kafka:1.3.2.BUILD-SNAPSHOT
26-Mar-2019 15:19:45       > Could not resolve io.spring.gradle:spring-io-plugin:0.0.4.RELEASE.
26-Mar-2019 15:19:45          > Could not get resource 'https://repo.spring.io/plugins-release/io/spring/gradle/spring-io-plugin/0.0.4.RELEASE/spring-io-plugin-0.0.4.RELEASE.pom'.
26-Mar-2019 15:19:45             > Could not HEAD 'https://repo.spring.io/plugins-release/io/spring/gradle/spring-io-plugin/0.0.4.RELEASE/spring-io-plugin-0.0.4.RELEASE.pom'.
26-Mar-2019 15:19:45                > peer not authenticated
26-Mar-2019 15:19:45
26-Mar-2019 15:19:45 * Try:
26-Mar-2019 15:19:45 Run with --stacktrace option to get the stack trace. Run with --info or --debug option to get more log output.
26-Mar-2019 15:19:45
26-Mar-2019 15:19:45 BUILD FAILED
26-Mar-2019 15:19:45
26-Mar-2019 15:19:45 Total time: 7.513 secs
26-Mar-2019 15:19:45
26-Mar-2019 15:19:45 Failing task since return code of [./gradlew clean build dist -I /tmp/artifactory.init.script6596063523084976047gradle -DbuildInfoConfig.propertiesFile=/tmp/buildinfo7745130467000432670properties artifactoryPublish -Dartifactory.resolve.password=******** -Dartifactory.publish.password=********] was 1 while expected 0
26-Mar-2019 15:19:45 Parsing test results under /opt/bamboo-home/xml-data/build-dir/INTEXT-SIK13-JOB1...
26-Mar-2019 15:19:45 Finished task 'Artifactory Gradle' with result: Failed
26-Mar-2019 15:19:45 Running post build plugin 'Docker Container Cleanup'
26-Mar-2019 15:19:45 Running post build plugin 'NCover Results Collector'
26-Mar-2019 15:19:45 Running post build plugin 'Artifactory Release Management Staging'
26-Mar-2019 15:19:45 Running post build plugin 'Artifactory Build Info Copier'
26-Mar-2019 15:19:45 Running post build plugin 'Artifactory Gradle Properties Info Copier'
26-Mar-2019 15:19:45 Running post build plugin 'Clover Results Collector'
26-Mar-2019 15:19:45 Running post build plugin 'npm Cache Cleanup'
26-Mar-2019 15:19:45 Running post build plugin 'Artifact Copier'
26-Mar-2019 15:19:45 Publishing an artifact: Test Results
26-Mar-2019 15:19:45 Finished publishing of artifact Job artifact: [Test Results], pattern: [build/reports/*tests/**/*.*] in 4.733 ms
26-Mar-2019 15:19:45 Finalising the build...
26-Mar-2019 15:19:45 Stopping timer.
26-Mar-2019 15:19:45 Build INTEXT-SIK13-JOB1-13 completed.
26-Mar-2019 15:19:45 Running on server: post build plugin 'NCover Results Collector'
26-Mar-2019 15:19:45 Running on server: post build plugin 'Build Hanging Detection Configuration'
26-Mar-2019 15:19:45 Running on server: post build plugin 'Clover Delta Calculator'
26-Mar-2019 15:19:45 Running on server: post build plugin 'Maven Dependencies Postprocessor'
26-Mar-2019 15:19:45 All post build plugins have finished
26-Mar-2019 15:19:45 Generating build results summary...
26-Mar-2019 15:19:45 Saving build results to disk...
26-Mar-2019 15:19:45 Logging substituted variables...
26-Mar-2019 15:19:45 Indexing build results...
26-Mar-2019 15:19:45 Finished building INTEXT-SIK13-JOB1-13.