Build: #14 failed

Job: Default Job failed

Stages & jobs

  1. Default Stage

Build log

The build generated 251 lines of output. Download or view full build log

28-Mar-2019 03:46:38 Build Spring Integration Extensions - Spring Integration Kafka (1.3.x) - Default Job #14 (INTEXT-SIK13-JOB1-14) started building on agent bamboo-07.af.pivotal.io
28-Mar-2019 03:46:38 Remote agent on host bamboo-07.af.pivotal.io
28-Mar-2019 03:46:38 Build working directory is /opt/bamboo-home/xml-data/build-dir/INTEXT-SIK13-JOB1
28-Mar-2019 03:46:38 Executing build Spring Integration Extensions - Spring Integration Kafka (1.3.x) - Default Job #14 (INTEXT-SIK13-JOB1-14)
28-Mar-2019 03:46:38 Starting task 'Checkout Default Repository' of type 'com.atlassian.bamboo.plugins.vcs:task.vcs.checkout'
28-Mar-2019 03:46:38 Build always requires a clean checkout
28-Mar-2019 03:46:38 Cleaning build directory '/opt/bamboo-home/xml-data/build-dir/INTEXT-SIK13-JOB1'
28-Mar-2019 03:46:38 Checking out into /opt/bamboo-home/xml-data/build-dir/INTEXT-SIK13-JOB1
28-Mar-2019 03:46:38 Updating source code to revision: 8ccba441d7f41f0ff03339ed1151608c27103a9b
28-Mar-2019 03:46:38 Creating local git repository in '/opt/bamboo-home/xml-data/build-dir/INTEXT-SIK13-JOB1/.git'.
28-Mar-2019 03:46:38 Initialized empty Git repository in /opt/bamboo-home/xml-data/build-dir/INTEXT-SIK13-JOB1/.git/
28-Mar-2019 03:46:38 Fetching 'refs/heads/1.3.x' from 'https://github.com/spring-projects/spring-integration-kafka.git'.
28-Mar-2019 03:46:41 From https://github.com/spring-projects/spring-integration-kafka
28-Mar-2019 03:46:41 * [new branch]      1.3.x      -> 1.3.x
28-Mar-2019 03:46:41 * [new tag]         1.0.0.RELEASE -> 1.0.0.RELEASE
28-Mar-2019 03:46:41 * [new tag]         1.1.0.RELEASE -> 1.1.0.RELEASE
28-Mar-2019 03:46:41 * [new tag]         1.2.0.RELEASE -> 1.2.0.RELEASE
28-Mar-2019 03:46:41 * [new tag]         v1.0.0.M3  -> v1.0.0.M3
28-Mar-2019 03:46:41 * [new tag]         v1.0.0.RC1 -> v1.0.0.RC1
28-Mar-2019 03:46:41 * [new tag]         v1.1.1.RELEASE -> v1.1.1.RELEASE
28-Mar-2019 03:46:41 * [new tag]         v1.1.2.RELEASE -> v1.1.2.RELEASE
28-Mar-2019 03:46:41 * [new tag]         v1.2.0.M1  -> v1.2.0.M1
28-Mar-2019 03:46:41 * [new tag]         v1.2.0.RC1 -> v1.2.0.RC1
28-Mar-2019 03:46:41 * [new tag]         v1.2.0.RELEASE -> v1.2.0.RELEASE
28-Mar-2019 03:46:41 * [new tag]         v1.2.1.RELEASE -> v1.2.1.RELEASE
28-Mar-2019 03:46:41 * [new tag]         v1.3.0.RELEASE -> v1.3.0.RELEASE
28-Mar-2019 03:46:41 Checking out revision 8ccba441d7f41f0ff03339ed1151608c27103a9b.
28-Mar-2019 03:46:41 Switched to branch '1.3.x'
28-Mar-2019 03:46:41 Updated source code to revision: 8ccba441d7f41f0ff03339ed1151608c27103a9b
28-Mar-2019 03:46:41 Finished task 'Checkout Default Repository' with result: Success
28-Mar-2019 03:46:41 Running pre-build action: Artifactory Release Staging
28-Mar-2019 03:46:41 Running pre-build action: VCS Version Collector
28-Mar-2019 03:46:41 Starting task 'Artifactory Gradle' of type 'org.jfrog.bamboo.bamboo-artifactory-plugin:artifactoryGradleTask'
28-Mar-2019 03:46:41 Bamboo Artifactory Plugin version: 2.5.x-SNAPSHOT
28-Mar-2019 03:46:41
Beginning to execute external process for build 'Spring Integration Extensions - Spring Integration Kafka (1.3.x) - Default Job #14 (INTEXT-SIK13-JOB1-14)'
... running command line:
./gradlew clean build dist -I /tmp/artifactory.init.script4464825781478733603gradle -DbuildInfoConfig.propertiesFile=/tmp/buildinfo8185179425954510259properties artifactoryPublish -Dartifactory.resolve.password=******** -Dartifactory.publish.password=********
... in: /opt/bamboo-home/xml-data/build-dir/INTEXT-SIK13-JOB1
... using extra environment variables:
bamboo_planRepository_1_branch=1.3.x
bamboo_********_username_password=********
bamboo_signing_store_password=********
bamboo_capability_system_builder_ant_Ant_1_9=/opt/ant-1.9
bamboo_capability_system_builder_ant_Ant_1_8=/opt/ant-1.8
bamboo_planRepository_1_branchDisplayName=1.3.x
bamboo_capability_system_jdk_OpenJDK_7u181=/opt/openjdk-7
bamboo_repository_revision_number=8ccba441d7f41f0ff03339ed1151608c27103a9b
bamboo_capability_system_builder_node_Node_js_6=/usr/bin/node
bamboo_RIAK_BIN=/usr/sbin/riak
WRAPPER_BITS=32
bamboo_buildKey=INTEXT-SIK13-JOB1
bamboo_bintray_password=********
bamboo_sonar_token_password=********
PWD=/opt/bamboo-home/bin
bamboo_shortJobName=Default Job
bamboo_capability_system_builder_gradle___gradlew=./gradlew
bamboo_buildResultsUrl=https://build.spring.io/browse/INTEXT-SIK13-JOB1-14
bamboo_capability_system_builder_mvn3_Maven_3_3=/opt/maven-3.3
bamboo_capability_system_builder_mvn3_Maven_3_2=/opt/maven-3.2
bamboo_capability_system_builder_mvn3_Maven_3_1=/opt/maven-3.1
bamboo_planRepository_repositoryUrl=https://github.com/spring-projects/spring-integration-kafka.git
bamboo_agentId=208568329
bamboo_capability_system_builder_mvn3_Maven_3_5=/opt/maven-3.5
bamboo_capability_system_builder_mvn3_Maven_3_0=/opt/maven-3.0
abilan=
bamboo_planRepository_revision=8ccba441d7f41f0ff03339ed1151608c27103a9b
bamboo_planRepository_previousRevision=020975815be311dd3dc70c90e252723dc6812986
bamboo_capability_remote_build=true
bamboo_repository_branch_name=1.3.x
bamboo_repository_193953817_git_username=spring-buildmaster
bamboo_sonatype_token_password=********
SHLVL=1
bamboo_org_jfrog_bamboo_buildInfo_serverUrl=https://repo.spring.io
bamboo_scdf_acceptance_tests_password=********
WRAPPER_OS=linux
JAVA_HOME=/opt/jdk-7/
XDG_SESSION_ID=20578
bamboo_capability_Agent=bamboo-07.af.pivotal.io
bamboo_planRepository_branch=1.3.x
bamboo_org_jfrog_bamboo_release_activated=false
bamboo_planRepository_1_type=gitv2
bamboo_planRepository_branchName=1.3.x
bamboo_capability_system_jdk_JDK_12=/opt/jdk-12
WRAPPER_FILE_SEPARATOR=/
_=./bamboo-agent.sh
bamboo_repository_193953817_branch_name=1.3.x
SSH_CLIENT=10.255.200.169 54165 22
WRAPPER_PATH_SEPARATOR=:
bamboo_sonar_password=********
bamboo_hg_cache_directory=/opt/bamboo-home/xml-data/build-dir/_hg-repositories-cache
bamboo_planRepository_1_username=spring-buildmaster
bamboo_planRepository_type=gitv2
bamboo_git_cache_directory=/opt/bamboo-home/xml-data/build-dir/_git-repositories-cache
bamboo_artifactory_username=buildmaster
bamboo_tmp_directory=/opt/bamboo-home/temp
SSH_CONNECTION=10.255.200.169 54165 10.194.6.17 22
bamboo_planKey=INTEXT-SIK13
bamboo_planRepository_username=spring-buildmaster
bamboo_JDK8_HOME=/opt/jdk-8
bamboo_repository_193953817_name=Spring Integration Extensions
NLSPATH=/usr/dt/lib/nls/msg/%L/%N.cat
bamboo_planRepository_1_branchName=1.3.x
bamboo_sonar_version=5.6.3
bamboo_capability_system_jdk_JDK_1_11=/opt/jdk-11
bamboo_resultsUrl=https://build.spring.io/browse/INTEXT-SIK13-JOB1-14
bamboo_capability_system_jdk_JDK_1_10=/opt/jdk-10
bamboo_build_working_directory=/opt/bamboo-home/xml-data/build-dir/INTEXT-SIK13-JOB1
bamboo_planRepository_1_name=Spring Integration Extensions
bamboo_capability_system_os=ubuntu1604
bamboo_repository_193953817_revision_number=8ccba441d7f41f0ff03339ed1151608c27103a9b
bamboo_nexusPush_stagingProfile=buildmaster
bamboo_shortPlanName=Spring Integration Kafka (1.3.x)
MAIL=/var/mail/bamboo
bamboo_planRepository_name=Spring Integration Extensions
LOGNAME=bamboo
bamboo_repository_193953817_git_branch=1.3.x
bamboo_buildNumber=14
SHELL=/bin/bash
bamboo_planName=Spring Integration Extensions - Spring Integration Kafka (1.3.x)
bamboo_JDK7_HOME=/opt/jdk-7
bamboo_shortPlanKey=SIK13
OLDPWD=/opt/bamboo-home/bin
bamboo_shortJobKey=JOB1
bamboo_artifactory_password=********
bamboo_buildTimeStamp=2019-03-28T03:46:37.976Z
bamboo_repository_previous_revision_number=020975815be311dd3dc70c90e252723dc6812986
bamboo_sonar_username=buildmaster
bamboo_********_password=********
bamboo_repository_git_branch=1.3.x
bamboo_buildResultKey=INTEXT-SIK13-JOB1-14
bamboo_nexusPush_close=true
bamboo_buildPlanName=Spring Integration Extensions - Spring Integration Kafka (1.3.x) - Default Job
bamboo_planRepository_1_revision=8ccba441d7f41f0ff03339ed1151608c27103a9b
bamboo_repository_name=Spring Integration Extensions
bamboo_signing_key_password=********
XFILESEARCHPATH=/usr/dt/app-defaults/%L/Dt
LANG=en_US.UTF-8
bamboo_buildFailed=false
bamboo_capability_system_docker_executable=/usr/bin/docker
bamboo_capability_system_builder_groovy_Groovy_2_4=/opt/groovy-2.4
bamboo_artifactory_password_mask_b=********
bamboo_capability_system_builder_command_Bash=/bin/bash
bamboo_artifactory_password_mask_a=********
bamboo_agentWorkingDirectory=/opt/bamboo-home/xml-data/build-dir
bamboo_capability_system_git_executable=/usr/bin/git
bamboo_repository_git_username=spring-buildmaster
bamboo_planRepository_1_previousRevision=020975815be311dd3dc70c90e252723dc6812986
bamboo_capability_os_family=unix
bamboo_planRepository_branchDisplayName=1.3.x
bamboo_capability_system_builder_maven_Artifactory_Maven_3_5=/opt/maven-3.5
bamboo_capability_system_builder_maven_Artifactory_Maven_3_3=/opt/maven-3.3
bamboo_capability_system_builder_maven_Artifactory_Maven_3_2=/opt/maven-3.2
bamboo_s3_properties=/home/bamboo/tools/s3.properties
bamboo_capability_system_builder_maven_Artifactory_Maven_3_1=/opt/maven-3.1
bamboo_capability_system_builder_maven_Artifactory_Maven_3_0=/opt/maven-3.0
bamboo_plan_storageTag=INTEXT-SIK13
bamboo_bintray_username_password=********
USER=bamboo
bamboo_repository_git_repositoryUrl=https://github.com/spring-projects/spring-integration-kafka.git
SSH_AUTH_SOCK=/tmp/ssh-Jre82mAvqx/agent.6400
bamboo_repository_193953817_git_repositoryUrl=https://github.com/spring-projects/spring-integration-kafka.git
bamboo_working_directory=/opt/bamboo-home/xml-data/build-dir/INTEXT-SIK13-JOB1
bamboo_org_jfrog_bamboo_buildInfo_activated=true
bamboo_planRepository_1_repositoryUrl=https://github.com/spring-projects/spring-integration-kafka.git
bamboo_capability_system_jdk_JDK_1_8=/opt/jdk-8
bamboo_capability_system_jdk_JDK_1_9=/opt/jdk-9
WRAPPER_ARCH=x86
bamboo_capability_system_jdk_JDK_1_6=/opt/jdk-6
bamboo_repository_193953817_previous_revision_number=020975815be311dd3dc70c90e252723dc6812986
bamboo_sonatype_password=********
bamboo_capability_system_jdk_JDK_1_7=/opt/jdk-7
bamboo_sonar_ip=10.194.6.9
XDG_RUNTIME_DIR=/run/user/505
HOME=/home/bamboo
PATH=/bin:/usr/local/sbin:/usr/local/bin:/usr/sbin:/usr/bin:/sbin:/bin:/usr/games:/usr/local/games:/bin:/usr/local/sbin:/usr/local/bin:/usr/sbin:/usr/bin:/sbin:/bin:/usr/games:/usr/local/games
28-Mar-2019 03:46:41 Downloading https://services.gradle.org/distributions/gradle-2.5-all.zip
28-Mar-2019 03:46:43 ...................................................................................................................................................................................................................................................................................................................................................................................................................................................................................................................................................................................................................................................................................................................................................................................................................................................................................................................................................................................................................................................................................................................................................................................................................................................................................................................................................................................................................................................................................................................................................................................................................................................................................................................................................................................................................................................................................................................................................................................................................................................................................................................................................................................................................................................................................................................................................................................................................................................................................................................................................................................................................................................................................................................................................................................................................................................................................................................................................................................................................................................................................................................................................................................................................................................................................................................................................................................
28-Mar-2019 03:46:43 Unzipping /home/bamboo/.gradle/wrapper/dists/gradle-2.5-all/d3xh0kipe7wr2bvnx5sk0hao8/gradle-2.5-all.zip to /home/bamboo/.gradle/wrapper/dists/gradle-2.5-all/d3xh0kipe7wr2bvnx5sk0hao8
28-Mar-2019 03:46:44 Set executable permissions for: /home/bamboo/.gradle/wrapper/dists/gradle-2.5-all/d3xh0kipe7wr2bvnx5sk0hao8/gradle-2.5/bin/gradle
28-Mar-2019 03:46:48 Failed to notify ProjectEvaluationListener.afterEvaluate(), but primary configuration failure takes precedence.
28-Mar-2019 03:46:48 org.gradle.api.ProjectConfigurationException: A problem occurred configuring root project 'spring-integration-kafka'.
28-Mar-2019 03:46:48         at org.gradle.configuration.project.LifecycleProjectEvaluator.addConfigurationFailure(LifecycleProjectEvaluator.java:79)
28-Mar-2019 03:46:48         at org.gradle.configuration.project.LifecycleProjectEvaluator.evaluate(LifecycleProjectEvaluator.java:57)
28-Mar-2019 03:46:48         at org.gradle.api.internal.project.AbstractProject.evaluate(AbstractProject.java:488)
28-Mar-2019 03:46:48         at org.gradle.api.internal.project.AbstractProject.evaluate(AbstractProject.java:86)
28-Mar-2019 03:46:48         at org.gradle.execution.TaskPathProjectEvaluator.configureHierarchy(TaskPathProjectEvaluator.java:42)
28-Mar-2019 03:46:48         at org.gradle.configuration.DefaultBuildConfigurer.configure(DefaultBuildConfigurer.java:35)
28-Mar-2019 03:46:48         at org.gradle.initialization.DefaultGradleLauncher$4.run(DefaultGradleLauncher.java:143)
28-Mar-2019 03:46:48         at org.gradle.internal.Factories$1.create(Factories.java:22)
28-Mar-2019 03:46:48         at org.gradle.internal.progress.DefaultBuildOperationExecutor.run(DefaultBuildOperationExecutor.java:62)
28-Mar-2019 03:46:48         at org.gradle.internal.progress.DefaultBuildOperationExecutor.run(DefaultBuildOperationExecutor.java:47)
28-Mar-2019 03:46:48         at org.gradle.initialization.DefaultGradleLauncher.runBuildOperation(DefaultGradleLauncher.java:189)
28-Mar-2019 03:46:48         at org.gradle.initialization.DefaultGradleLauncher.doBuildStages(DefaultGradleLauncher.java:140)
28-Mar-2019 03:46:48         at org.gradle.initialization.DefaultGradleLauncher.access$200(DefaultGradleLauncher.java:35)
28-Mar-2019 03:46:48         at org.gradle.initialization.DefaultGradleLauncher$1.create(DefaultGradleLauncher.java:104)
28-Mar-2019 03:46:48         at org.gradle.initialization.DefaultGradleLauncher$1.create(DefaultGradleLauncher.java:97)
28-Mar-2019 03:46:48         at org.gradle.internal.progress.DefaultBuildOperationExecutor.run(DefaultBuildOperationExecutor.java:62)
28-Mar-2019 03:46:48         at org.gradle.initialization.DefaultGradleLauncher.runRootBuildOperation(DefaultGradleLauncher.java:184)
28-Mar-2019 03:46:48         at org.gradle.initialization.DefaultGradleLauncher.doBuild(DefaultGradleLauncher.java:97)
28-Mar-2019 03:46:48         at org.gradle.initialization.DefaultGradleLauncher.run(DefaultGradleLauncher.java:86)
28-Mar-2019 03:46:48         at org.gradle.launcher.exec.InProcessBuildActionExecuter$DefaultBuildController.run(InProcessBuildActionExecuter.java:93)
28-Mar-2019 03:46:48         at org.gradle.tooling.internal.provider.ExecuteBuildActionRunner.run(ExecuteBuildActionRunner.java:28)
28-Mar-2019 03:46:48         at org.gradle.launcher.exec.ChainingBuildActionRunner.run(ChainingBuildActionRunner.java:35)
28-Mar-2019 03:46:48         at org.gradle.launcher.exec.InProcessBuildActionExecuter.execute(InProcessBuildActionExecuter.java:43)
28-Mar-2019 03:46:48         at org.gradle.launcher.exec.InProcessBuildActionExecuter.execute(InProcessBuildActionExecuter.java:27)
28-Mar-2019 03:46:48         at org.gradle.launcher.exec.ContinuousBuildActionExecuter.execute(ContinuousBuildActionExecuter.java:72)
28-Mar-2019 03:46:48         at org.gradle.launcher.exec.ContinuousBuildActionExecuter.execute(ContinuousBuildActionExecuter.java:44)
28-Mar-2019 03:46:48         at org.gradle.launcher.exec.DaemonUsageSuggestingBuildActionExecuter.execute(DaemonUsageSuggestingBuildActionExecuter.java:50)
28-Mar-2019 03:46:48         at org.gradle.launcher.exec.DaemonUsageSuggestingBuildActionExecuter.execute(DaemonUsageSuggestingBuildActionExecuter.java:27)
28-Mar-2019 03:46:48         at org.gradle.launcher.cli.RunBuildAction.run(RunBuildAction.java:40)
28-Mar-2019 03:46:48         at org.gradle.internal.Actions$RunnableActionAdapter.execute(Actions.java:170)
28-Mar-2019 03:46:48         at org.gradle.launcher.cli.CommandLineActionFactory$ParseAndBuildAction.execute(CommandLineActionFactory.java:237)
28-Mar-2019 03:46:48         at org.gradle.launcher.cli.CommandLineActionFactory$ParseAndBuildAction.execute(CommandLineActionFactory.java:210)
28-Mar-2019 03:46:48         at org.gradle.launcher.cli.JavaRuntimeValidationAction.execute(JavaRuntimeValidationAction.java:35)
28-Mar-2019 03:46:48         at org.gradle.launcher.cli.JavaRuntimeValidationAction.execute(JavaRuntimeValidationAction.java:24)
28-Mar-2019 03:46:48         at org.gradle.launcher.cli.CommandLineActionFactory$WithLogging.execute(CommandLineActionFactory.java:206)
28-Mar-2019 03:46:48         at org.gradle.launcher.cli.CommandLineActionFactory$WithLogging.execute(CommandLineActionFactory.java:169)
28-Mar-2019 03:46:48         at org.gradle.launcher.cli.ExceptionReportingAction.execute(ExceptionReportingAction.java:33)
28-Mar-2019 03:46:48         at org.gradle.launcher.cli.ExceptionReportingAction.execute(ExceptionReportingAction.java:22)
28-Mar-2019 03:46:48         at org.gradle.launcher.Main.doAction(Main.java:33)
28-Mar-2019 03:46:48         at org.gradle.launcher.bootstrap.EntryPoint.run(EntryPoint.java:45)
28-Mar-2019 03:46:48         at sun.reflect.NativeMethodAccessorImpl.invoke0(Native Method)
28-Mar-2019 03:46:48         at sun.reflect.NativeMethodAccessorImpl.invoke(NativeMethodAccessorImpl.java:57)
28-Mar-2019 03:46:48         at sun.reflect.DelegatingMethodAccessorImpl.invoke(DelegatingMethodAccessorImpl.java:43)
28-Mar-2019 03:46:48         at java.lang.reflect.Method.invoke(Method.java:606)
28-Mar-2019 03:46:48         at org.gradle.launcher.bootstrap.ProcessBootstrap.runNoExit(ProcessBootstrap.java:54)
28-Mar-2019 03:46:48         at org.gradle.launcher.bootstrap.ProcessBootstrap.run(ProcessBootstrap.java:35)
28-Mar-2019 03:46:48         at org.gradle.launcher.GradleMain.main(GradleMain.java:23)
28-Mar-2019 03:46:48         at sun.reflect.NativeMethodAccessorImpl.invoke0(Native Method)
28-Mar-2019 03:46:48         at sun.reflect.NativeMethodAccessorImpl.invoke(NativeMethodAccessorImpl.java:57)
28-Mar-2019 03:46:48         at sun.reflect.DelegatingMethodAccessorImpl.invoke(DelegatingMethodAccessorImpl.java:43)
28-Mar-2019 03:46:48         at java.lang.reflect.Method.invoke(Method.java:606)
28-Mar-2019 03:46:48         at org.gradle.wrapper.BootstrapMainStarter.start(BootstrapMainStarter.java:30)
28-Mar-2019 03:46:48         at org.gradle.wrapper.WrapperExecutor.execute(WrapperExecutor.java:127)
28-Mar-2019 03:46:48         at org.gradle.wrapper.GradleWrapperMain.main(GradleWrapperMain.java:61)
28-Mar-2019 03:46:48 Caused by: org.gradle.api.artifacts.ResolveException: Could not resolve all dependencies for configuration ':classpath'.
28-Mar-2019 03:46:48         at org.gradle.api.internal.artifacts.ivyservice.DefaultLenientConfiguration.rethrowFailure(DefaultLenientConfiguration.java:63)
28-Mar-2019 03:46:48         at org.gradle.api.internal.artifacts.ivyservice.DefaultResolvedConfiguration.rethrowFailure(DefaultResolvedConfiguration.java:36)
28-Mar-2019 03:46:48         at org.gradle.api.internal.artifacts.ivyservice.SelfResolvingDependencyResolver$FilesAggregatingResolvedConfiguration.rethrowFailure(SelfResolvingDependencyResolver.java:115)
28-Mar-2019 03:46:48         at org.gradle.api.internal.artifacts.ivyservice.ErrorHandlingArtifactDependencyResolver$ErrorHandlingResolvedConfiguration.rethrowFailure(ErrorHandlingArtifactDependencyResolver.java:191)
28-Mar-2019 03:46:48         at org.gradle.api.internal.artifacts.configurations.DefaultConfiguration$ConfigurationFileCollection.getFiles(DefaultConfiguration.java:674)
28-Mar-2019 03:46:48         at org.gradle.api.internal.artifacts.configurations.DefaultConfiguration.getFiles(DefaultConfiguration.java:284)
28-Mar-2019 03:46:48         at org.gradle.api.internal.artifacts.configurations.DefaultConfiguration_Decorated.getFiles(Unknown Source)
28-Mar-2019 03:46:48         at org.gradle.api.internal.initialization.DefaultScriptHandler.getScriptClassPath(DefaultScriptHandler.java:70)
28-Mar-2019 03:46:48         at org.gradle.plugin.use.internal.DefaultPluginRequestApplicator.defineScriptHandlerClassScope(DefaultPluginRequestApplicator.java:141)
28-Mar-2019 03:46:48         at org.gradle.plugin.use.internal.DefaultPluginRequestApplicator.applyPlugins(DefaultPluginRequestApplicator.java:54)
28-Mar-2019 03:46:48         at org.gradle.configuration.DefaultScriptPluginFactory$ScriptPluginImpl.apply(DefaultScriptPluginFactory.java:129)
28-Mar-2019 03:46:48         at org.gradle.configuration.project.BuildScriptProcessor.execute(BuildScriptProcessor.java:39)
28-Mar-2019 03:46:48         at org.gradle.configuration.project.BuildScriptProcessor.execute(BuildScriptProcessor.java:26)
28-Mar-2019 03:46:48         at org.gradle.configuration.project.ConfigureActionsProjectEvaluator.evaluate(ConfigureActionsProjectEvaluator.java:34)
28-Mar-2019 03:46:48         at org.gradle.configuration.project.LifecycleProjectEvaluator.evaluate(LifecycleProjectEvaluator.java:55)
28-Mar-2019 03:46:48         ... 52 more
28-Mar-2019 03:46:48 Caused by: org.gradle.internal.resolve.ModuleVersionResolveException: Could not resolve io.spring.gradle:spring-io-plugin:0.0.4.RELEASE.
28-Mar-2019 03:46:48 Required by:
28-Mar-2019 03:46:48     :spring-integration-kafka:1.3.2.BUILD-SNAPSHOT
28-Mar-2019 03:46:48         at org.gradle.api.internal.artifacts.ivyservice.ivyresolve.RepositoryChainComponentMetaDataResolver.resolveModule(RepositoryChainComponentMetaDataResolver.java:83)
28-Mar-2019 03:46:48         at org.gradle.api.internal.artifacts.ivyservice.ivyresolve.RepositoryChainComponentMetaDataResolver.resolve(RepositoryChainComponentMetaDataResolver.java:59)
28-Mar-2019 03:46:48         at org.gradle.api.internal.artifacts.ivyservice.clientmodule.ClientModuleResolver.resolve(ClientModuleResolver.java:44)
28-Mar-2019 03:46:48         at org.gradle.api.internal.artifacts.ivyservice.projectmodule.ProjectDependencyResolver.resolve(ProjectDependencyResolver.java:72)
28-Mar-2019 03:46:48         at org.gradle.api.internal.artifacts.ivyservice.resolveengine.graph.DependencyGraphBuilder$ModuleVersionResolveState.resolve(DependencyGraphBuilder.java:575)
28-Mar-2019 03:46:48         at org.gradle.api.internal.artifacts.ivyservice.resolveengine.graph.DependencyGraphBuilder$ModuleVersionResolveState.getMetaData(DependencyGraphBuilder.java:585)
28-Mar-2019 03:46:48         at org.gradle.api.internal.artifacts.ivyservice.resolveengine.graph.DependencyGraphBuilder$DependencyEdge.calculateTargetConfigurations(DependencyGraphBuilder.java:270)
28-Mar-2019 03:46:48         at org.gradle.api.internal.artifacts.ivyservice.resolveengine.graph.DependencyGraphBuilder$DependencyEdge.attachToTargetConfigurations(DependencyGraphBuilder.java:244)
28-Mar-2019 03:46:48         at org.gradle.api.internal.artifacts.ivyservice.resolveengine.graph.DependencyGraphBuilder.traverseGraph(DependencyGraphBuilder.java:156)
28-Mar-2019 03:46:48         at org.gradle.api.internal.artifacts.ivyservice.resolveengine.graph.DependencyGraphBuilder.resolveDependencyGraph(DependencyGraphBuilder.java:94)
28-Mar-2019 03:46:48         at org.gradle.api.internal.artifacts.ivyservice.resolveengine.graph.DependencyGraphBuilder.resolve(DependencyGraphBuilder.java:84)
28-Mar-2019 03:46:48         at org.gradle.api.internal.artifacts.ivyservice.resolveengine.DefaultDependencyResolver$1.execute(DefaultDependencyResolver.java:142)
28-Mar-2019 03:46:48         at org.gradle.api.internal.artifacts.ivyservice.resolveengine.DefaultDependencyResolver$1.execute(DefaultDependencyResolver.java:96)
28-Mar-2019 03:46:48         at org.gradle.internal.Transformers$4.transform(Transformers.java:137)
28-Mar-2019 03:46:48         at org.gradle.api.internal.artifacts.ivyservice.DefaultIvyContextManager.withIvy(DefaultIvyContextManager.java:61)
28-Mar-2019 03:46:48         at org.gradle.api.internal.artifacts.ivyservice.DefaultIvyContextManager.withIvy(DefaultIvyContextManager.java:39)
28-Mar-2019 03:46:48         at org.gradle.api.internal.artifacts.ivyservice.resolveengine.DefaultDependencyResolver.resolve(DefaultDependencyResolver.java:96)
28-Mar-2019 03:46:48         at org.gradle.api.internal.artifacts.ivyservice.CacheLockingArtifactDependencyResolver$1.run(CacheLockingArtifactDependencyResolver.java:42)
28-Mar-2019 03:46:48         at org.gradle.internal.Factories$1.create(Factories.java:22)
28-Mar-2019 03:46:48         at org.gradle.cache.internal.DefaultCacheAccess.useCache(DefaultCacheAccess.java:192)
28-Mar-2019 03:46:48         at org.gradle.cache.internal.DefaultCacheAccess.useCache(DefaultCacheAccess.java:175)
28-Mar-2019 03:46:48         at org.gradle.cache.internal.DefaultPersistentDirectoryStore.useCache(DefaultPersistentDirectoryStore.java:106)
28-Mar-2019 03:46:48         at org.gradle.cache.internal.DefaultCacheFactory$ReferenceTrackingCache.useCache(DefaultCacheFactory.java:187)
28-Mar-2019 03:46:48         at org.gradle.api.internal.artifacts.ivyservice.DefaultCacheLockingManager.useCache(DefaultCacheLockingManager.java:64)
28-Mar-2019 03:46:48         at org.gradle.api.internal.artifacts.ivyservice.CacheLockingArtifactDependencyResolver.resolve(CacheLockingArtifactDependencyResolver.java:40)
28-Mar-2019 03:46:48         at org.gradle.api.internal.artifacts.ivyservice.SelfResolvingDependencyResolver.resolve(SelfResolvingDependencyResolver.java:41)
28-Mar-2019 03:46:48         at org.gradle.api.internal.artifacts.ivyservice.ShortcircuitEmptyConfigsArtifactDependencyResolver.resolve(ShortcircuitEmptyConfigsArtifactDependencyResolver.java:56)
28-Mar-2019 03:46:48         at org.gradle.api.internal.artifacts.ivyservice.ErrorHandlingArtifactDependencyResolver.resolve(ErrorHandlingArtifactDependencyResolver.java:46)
28-Mar-2019 03:46:48         at org.gradle.api.internal.artifacts.ivyservice.DefaultConfigurationResolver.resolve(DefaultConfigurationResolver.java:45)
28-Mar-2019 03:46:48         at org.gradle.api.internal.artifacts.configurations.DefaultConfiguration.resolveGraphIfRequired(DefaultConfiguration.java:363)
28-Mar-2019 03:46:48         at org.gradle.api.internal.artifacts.configurations.DefaultConfiguration.resolveNow(DefaultConfiguration.java:338)
28-Mar-2019 03:46:48         at org.gradle.api.internal.artifacts.configurations.DefaultConfiguration.getResolvedConfiguration(DefaultConfiguration.java:331)
28-Mar-2019 03:46:48         at org.gradle.api.internal.artifacts.configurations.DefaultConfiguration_Decorated.getResolvedConfiguration(Unknown Source)
28-Mar-2019 03:46:48         at org.gradle.api.internal.artifacts.configurations.DefaultConfiguration$ConfigurationFileCollection.getFiles(DefaultConfiguration.java:672)
28-Mar-2019 03:46:48         ... 62 more
28-Mar-2019 03:46:48 Caused by: org.gradle.internal.resolve.ModuleVersionResolveException: Could not resolve io.spring.gradle:spring-io-plugin:0.0.4.RELEASE.
28-Mar-2019 03:46:48         at org.gradle.api.internal.artifacts.ivyservice.ivyresolve.ErrorHandlingModuleComponentRepository$ErrorHandlingModuleComponentRepositoryAccess.resolveComponentMetaData(ErrorHandlingModuleComponentRepository.java:91)
28-Mar-2019 03:46:48         at org.gradle.api.internal.artifacts.ivyservice.ivyresolve.ComponentMetaDataResolveState.process(ComponentMetaDataResolveState.java:66)
28-Mar-2019 03:46:48         at org.gradle.api.internal.artifacts.ivyservice.ivyresolve.ComponentMetaDataResolveState.resolve(ComponentMetaDataResolveState.java:58)
28-Mar-2019 03:46:48         at org.gradle.api.internal.artifacts.ivyservice.ivyresolve.RepositoryChainComponentMetaDataResolver.findBestMatch(RepositoryChainComponentMetaDataResolver.java:116)
28-Mar-2019 03:46:48         at org.gradle.api.internal.artifacts.ivyservice.ivyresolve.RepositoryChainComponentMetaDataResolver.findBestMatch(RepositoryChainComponentMetaDataResolver.java:99)
28-Mar-2019 03:46:48         at org.gradle.api.internal.artifacts.ivyservice.ivyresolve.RepositoryChainComponentMetaDataResolver.resolveModule(RepositoryChainComponentMetaDataResolver.java:72)
28-Mar-2019 03:46:48         ... 95 more
28-Mar-2019 03:46:48 Caused by: org.gradle.internal.resource.ResourceException: Could not get resource 'https://repo.spring.io/plugins-release/io/spring/gradle/spring-io-plugin/0.0.4.RELEASE/spring-io-plugin-0.0.4.RELEASE.pom'.
28-Mar-2019 03:46:48         at org.gradle.internal.resource.ResourceException.failure(ResourceException.java:61)
28-Mar-2019 03:46:48         at org.gradle.api.internal.artifacts.repositories.resolver.DefaultExternalResourceArtifactResolver.downloadStaticResource(DefaultExternalResourceArtifactResolver.java:99)
28-Mar-2019 03:46:48         at org.gradle.api.internal.artifacts.repositories.resolver.DefaultExternalResourceArtifactResolver.resolveMetaDataArtifact(DefaultExternalResourceArtifactResolver.java:56)
28-Mar-2019 03:46:48         at org.gradle.api.internal.artifacts.repositories.resolver.ExternalResourceResolver.parseMetaDataFromArtifact(ExternalResourceResolver.java:168)
28-Mar-2019 03:46:48         at org.gradle.api.internal.artifacts.repositories.resolver.ExternalResourceResolver.resolveStaticDependency(ExternalResourceResolver.java:147)
28-Mar-2019 03:46:48         at org.gradle.api.internal.artifacts.repositories.resolver.MavenResolver.doResolveComponentMetaData(MavenResolver.java:93)
28-Mar-2019 03:46:48         at org.gradle.api.internal.artifacts.repositories.resolver.ExternalResourceResolver$RemoteRepositoryAccess.resolveComponentMetaData(ExternalResourceResolver.java:412)
28-Mar-2019 03:46:48         at org.gradle.api.internal.artifacts.ivyservice.ivyresolve.CacheLockReleasingModuleComponentsRepository$LockReleasingRepositoryAccess$2.run(CacheLockReleasingModuleComponentsRepository.java:71)
28-Mar-2019 03:46:48         at org.gradle.internal.Factories$1.create(Factories.java:22)
28-Mar-2019 03:46:48         at org.gradle.cache.internal.DefaultCacheAccess.longRunningOperation(DefaultCacheAccess.java:242)
28-Mar-2019 03:46:48         at org.gradle.cache.internal.DefaultCacheAccess.longRunningOperation(DefaultCacheAccess.java:313)
28-Mar-2019 03:46:48         at org.gradle.cache.internal.DefaultPersistentDirectoryStore.longRunningOperation(DefaultPersistentDirectoryStore.java:114)
28-Mar-2019 03:46:48         at org.gradle.cache.internal.DefaultCacheFactory$ReferenceTrackingCache.longRunningOperation(DefaultCacheFactory.java:179)
28-Mar-2019 03:46:48         at org.gradle.api.internal.artifacts.ivyservice.DefaultCacheLockingManager.longRunningOperation(DefaultCacheLockingManager.java:56)
28-Mar-2019 03:46:48         at org.gradle.api.internal.artifacts.ivyservice.ivyresolve.CacheLockReleasingModuleComponentsRepository$LockReleasingRepositoryAccess.resolveComponentMetaData(CacheLockReleasingModuleComponentsRepository.java:69)
28-Mar-2019 03:46:48         at org.gradle.api.internal.artifacts.ivyservice.ivyresolve.CachingModuleComponentRepository$ResolveAndCacheRepositoryAccess.resolveComponentMetaData(CachingModuleComponentRepository.java:297)
28-Mar-2019 03:46:48         at org.gradle.api.internal.artifacts.ivyservice.ivyresolve.BaseModuleComponentRepositoryAccess.resolveComponentMetaData(BaseModuleComponentRepositoryAccess.java:42)
28-Mar-2019 03:46:48         at org.gradle.api.internal.artifacts.ivyservice.ivyresolve.memcache.InMemoryCachedModuleComponentRepository$CachedAccess.resolveComponentMetaData(InMemoryCachedModuleComponentRepository.java:76)
28-Mar-2019 03:46:48         at org.gradle.api.internal.artifacts.ivyservice.ivyresolve.ErrorHandlingModuleComponentRepository$ErrorHandlingModuleComponentRepositoryAccess.resolveComponentMetaData(ErrorHandlingModuleComponentRepository.java:89)
28-Mar-2019 03:46:48         ... 100 more
28-Mar-2019 03:46:48 Caused by: org.gradle.internal.resource.transport.http.HttpRequestException: Could not HEAD 'https://repo.spring.io/plugins-release/io/spring/gradle/spring-io-plugin/0.0.4.RELEASE/spring-io-plugin-0.0.4.RELEASE.pom'.
28-Mar-2019 03:46:48         at org.gradle.internal.resource.transport.http.HttpClientHelper.performRequest(HttpClientHelper.java:83)
28-Mar-2019 03:46:48         at org.gradle.internal.resource.transport.http.HttpClientHelper.performRawHead(HttpClientHelper.java:61)
28-Mar-2019 03:46:48         at org.gradle.internal.resource.transport.http.HttpClientHelper.performHead(HttpClientHelper.java:65)
28-Mar-2019 03:46:48         at org.gradle.internal.resource.transport.http.HttpResourceAccessor.getMetaData(HttpResourceAccessor.java:85)
28-Mar-2019 03:46:48         at org.gradle.internal.resource.transfer.DefaultExternalResourceConnector.getMetaData(DefaultExternalResourceConnector.java:47)
28-Mar-2019 03:46:48         at org.gradle.internal.resource.transport.DefaultExternalResourceRepository.getResourceMetaData(DefaultExternalResourceRepository.java:68)
28-Mar-2019 03:46:48         at org.gradle.internal.resource.transfer.DefaultCacheAwareExternalResourceAccessor.getResource(DefaultCacheAwareExternalResourceAccessor.java:84)
28-Mar-2019 03:46:48         at org.gradle.api.internal.artifacts.repositories.resolver.DefaultExternalResourceArtifactResolver.downloadStaticResource(DefaultExternalResourceArtifactResolver.java:90)
28-Mar-2019 03:46:48         ... 117 more
28-Mar-2019 03:46:48 Caused by: javax.net.ssl.SSLPeerUnverifiedException: peer not authenticated
28-Mar-2019 03:46:48         at sun.security.ssl.SSLSessionImpl.getPeerCertificates(SSLSessionImpl.java:421)
28-Mar-2019 03:46:48         at org.apache.http.conn.ssl.AbstractVerifier.verify(AbstractVerifier.java:128)
28-Mar-2019 03:46:48         at org.apache.http.conn.ssl.SSLSocketFactory.connectSocket(SSLSocketFactory.java:572)
28-Mar-2019 03:46:48         at org.apache.http.impl.conn.DefaultClientConnectionOperator.openConnection(DefaultClientConnectionOperator.java:180)
28-Mar-2019 03:46:48         at org.apache.http.impl.conn.ManagedClientConnectionImpl.open(ManagedClientConnectionImpl.java:294)
28-Mar-2019 03:46:48         at org.apache.http.impl.client.DefaultRequestDirector.tryConnect(DefaultRequestDirector.java:640)
28-Mar-2019 03:46:48         at org.apache.http.impl.client.DefaultRequestDirector.execute(DefaultRequestDirector.java:479)
28-Mar-2019 03:46:48         at org.apache.http.impl.client.AbstractHttpClient.execute(AbstractHttpClient.java:906)
28-Mar-2019 03:46:48         at org.apache.http.impl.client.DecompressingHttpClient.execute(DecompressingHttpClient.java:137)
28-Mar-2019 03:46:48         at org.apache.http.impl.client.DecompressingHttpClient.execute(DecompressingHttpClient.java:118)
28-Mar-2019 03:46:48         at org.gradle.internal.resource.transport.http.HttpClientHelper.performHttpRequest(HttpClientHelper.java:113)
28-Mar-2019 03:46:48         at org.gradle.internal.resource.transport.http.HttpClientHelper.executeGetOrHead(HttpClientHelper.java:90)
28-Mar-2019 03:46:48         at org.gradle.internal.resource.transport.http.HttpClientHelper.performRequest(HttpClientHelper.java:81)
28-Mar-2019 03:46:48         ... 124 more
28-Mar-2019 03:46:48
28-Mar-2019 03:46:48 FAILURE: Build failed with an exception.
28-Mar-2019 03:46:48
28-Mar-2019 03:46:48 * What went wrong:
28-Mar-2019 03:46:48 A problem occurred configuring root project 'spring-integration-kafka'.
28-Mar-2019 03:46:48 > Could not resolve all dependencies for configuration ':classpath'.
28-Mar-2019 03:46:48    > Could not resolve io.spring.gradle:spring-io-plugin:0.0.4.RELEASE.
28-Mar-2019 03:46:48      Required by:
28-Mar-2019 03:46:48          :spring-integration-kafka:1.3.2.BUILD-SNAPSHOT
28-Mar-2019 03:46:48       > Could not resolve io.spring.gradle:spring-io-plugin:0.0.4.RELEASE.
28-Mar-2019 03:46:48          > Could not get resource 'https://repo.spring.io/plugins-release/io/spring/gradle/spring-io-plugin/0.0.4.RELEASE/spring-io-plugin-0.0.4.RELEASE.pom'.
28-Mar-2019 03:46:48             > Could not HEAD 'https://repo.spring.io/plugins-release/io/spring/gradle/spring-io-plugin/0.0.4.RELEASE/spring-io-plugin-0.0.4.RELEASE.pom'.
28-Mar-2019 03:46:48                > peer not authenticated
28-Mar-2019 03:46:48
28-Mar-2019 03:46:48 * Try:
28-Mar-2019 03:46:48 Run with --stacktrace option to get the stack trace. Run with --info or --debug option to get more log output.
28-Mar-2019 03:46:48
28-Mar-2019 03:46:48 BUILD FAILED
28-Mar-2019 03:46:48
28-Mar-2019 03:46:48 Total time: 7.417 secs
28-Mar-2019 03:46:49
28-Mar-2019 03:46:49 Failing task since return code of [./gradlew clean build dist -I /tmp/artifactory.init.script4464825781478733603gradle -DbuildInfoConfig.propertiesFile=/tmp/buildinfo8185179425954510259properties artifactoryPublish -Dartifactory.resolve.password=******** -Dartifactory.publish.password=********] was 1 while expected 0
28-Mar-2019 03:46:49 Parsing test results under /opt/bamboo-home/xml-data/build-dir/INTEXT-SIK13-JOB1...
28-Mar-2019 03:46:49 Finished task 'Artifactory Gradle' with result: Failed
28-Mar-2019 03:46:49 Running post build plugin 'Docker Container Cleanup'
28-Mar-2019 03:46:49 Running post build plugin 'NCover Results Collector'
28-Mar-2019 03:46:49 Running post build plugin 'Artifactory Release Management Staging'
28-Mar-2019 03:46:49 Running post build plugin 'Artifactory Build Info Copier'
28-Mar-2019 03:46:49 Running post build plugin 'Artifactory Gradle Properties Info Copier'
28-Mar-2019 03:46:49 Running post build plugin 'Clover Results Collector'
28-Mar-2019 03:46:49 Running post build plugin 'npm Cache Cleanup'
28-Mar-2019 03:46:49 Running post build plugin 'Artifact Copier'
28-Mar-2019 03:46:49 Publishing an artifact: Test Results
28-Mar-2019 03:46:49 Finished publishing of artifact Job artifact: [Test Results], pattern: [build/reports/*tests/**/*.*] in 4.886 ms
28-Mar-2019 03:46:49 Finalising the build...
28-Mar-2019 03:46:49 Stopping timer.
28-Mar-2019 03:46:49 Build INTEXT-SIK13-JOB1-14 completed.
28-Mar-2019 03:46:49 Running on server: post build plugin 'NCover Results Collector'
28-Mar-2019 03:46:49 Running on server: post build plugin 'Build Hanging Detection Configuration'
28-Mar-2019 03:46:49 Running on server: post build plugin 'Clover Delta Calculator'
28-Mar-2019 03:46:49 Running on server: post build plugin 'Maven Dependencies Postprocessor'
28-Mar-2019 03:46:49 All post build plugins have finished
28-Mar-2019 03:46:49 Generating build results summary...
28-Mar-2019 03:46:49 Saving build results to disk...
28-Mar-2019 03:46:49 Logging substituted variables...
28-Mar-2019 03:46:49 Indexing build results...
28-Mar-2019 03:46:49 Finished building INTEXT-SIK13-JOB1-14.