Test results

  • 30 tests in total
  • 10 tests failed
  • 10 failures are new
  • 11 tests were quarantined / skipped
  • 2 seconds taken in total.
New test failures 10
Status Test View job Duration
Collapse Failed TestReceivingMessageSourceParserTests testReceivingAdapterConfigurationAutoStartup History
Default Job < 1 sec
org.springframework.beans.factory.xml.XmlBeanDefinitionStoreException: org.springframework.beans.factory.xml.XmlBeanDefinitionStoreException: Line 21 in XML document from class path resource [org/springframework/integration/twitter/config/TestReceivingMessageSourceParser-context.xml] is invalid; nested exception is org.xml.sax.SAXParseException; lineNumber: 21; columnNumber: 35; cvc-complex-type.2.4.c: The matching wildcard is strict, but no declaration can be found for element 'twitter:mentions-inbound-channel-adapter'.
org.springframework.beans.factory.xml.XmlBeanDefinitionStoreException: Line 21 in XML document from class path resource [org/springframework/integration/twitter/config/TestReceivingMessageSourceParser-context.xml] is invalid; nested exception is org.xml.sax.SAXParseException; lineNumber: 21; columnNumber: 35; cvc-complex-type.2.4.c: The matching wildcard is strict, but no declaration can be found for element 'twitter:mentions-inbound-channel-adapter'.
	at org.springframework.beans.factory.xml.XmlBeanDefinitionReader.doLoadBeanDefinitions(XmlBeanDefinitionReader.java:404)
	at org.springframework.beans.factory.xml.XmlBeanDefinitionReader.loadBeanDefinitions(XmlBeanDefinitionReader.java:336)
	at org.springframework.beans.factory.xml.XmlBeanDefinitionReader.loadBeanDefinitions(XmlBeanDefinitionReader.java:304)
	at org.springframework.beans.factory.support.AbstractBeanDefinitionReader.loadBeanDefinitions(AbstractBeanDefinitionReader.java:188)
	at org.springframework.context.support.AbstractXmlApplicationContext.loadBeanDefinitions(AbstractXmlApplicationContext.java:124)
	at org.springframework.context.support.AbstractXmlApplicationContext.loadBeanDefinitions(AbstractXmlApplicationContext.java:94)
(78 more lines...)
Collapse Failed TestReceivingMessageSourceParserTests testThatMessageSourcesAreRegisteredAsBeans History
Default Job < 1 sec
org.springframework.beans.factory.xml.XmlBeanDefinitionStoreException: org.springframework.beans.factory.xml.XmlBeanDefinitionStoreException: Line 21 in XML document from class path resource [org/springframework/integration/twitter/config/TestReceivingMessageSourceParser-context.xml] is invalid; nested exception is org.xml.sax.SAXParseException; lineNumber: 21; columnNumber: 35; cvc-complex-type.2.4.c: The matching wildcard is strict, but no declaration can be found for element 'twitter:mentions-inbound-channel-adapter'.
org.springframework.beans.factory.xml.XmlBeanDefinitionStoreException: Line 21 in XML document from class path resource [org/springframework/integration/twitter/config/TestReceivingMessageSourceParser-context.xml] is invalid; nested exception is org.xml.sax.SAXParseException; lineNumber: 21; columnNumber: 35; cvc-complex-type.2.4.c: The matching wildcard is strict, but no declaration can be found for element 'twitter:mentions-inbound-channel-adapter'.
	at org.springframework.beans.factory.xml.XmlBeanDefinitionReader.doLoadBeanDefinitions(XmlBeanDefinitionReader.java:404)
	at org.springframework.beans.factory.xml.XmlBeanDefinitionReader.loadBeanDefinitions(XmlBeanDefinitionReader.java:336)
	at org.springframework.beans.factory.xml.XmlBeanDefinitionReader.loadBeanDefinitions(XmlBeanDefinitionReader.java:304)
	at org.springframework.beans.factory.support.AbstractBeanDefinitionReader.loadBeanDefinitions(AbstractBeanDefinitionReader.java:188)
	at org.springframework.context.support.AbstractXmlApplicationContext.loadBeanDefinitions(AbstractXmlApplicationContext.java:124)
	at org.springframework.context.support.AbstractXmlApplicationContext.loadBeanDefinitions(AbstractXmlApplicationContext.java:94)
(78 more lines...)
Collapse Failed TestSearchReceivingMessageSourceParserTests testSearchReceivingDefaultTemplate History
Default Job < 1 sec
org.springframework.beans.factory.xml.XmlBeanDefinitionStoreException: org.springframework.beans.factory.xml.XmlBeanDefinitionStoreException: Line 23 in XML document from class path resource [org/springframework/integration/twitter/config/TestSearchReceivingMessageSourceParser-context.xml] is invalid; nested exception is org.xml.sax.SAXParseException; lineNumber: 23; columnNumber: 28; cvc-complex-type.2.4.c: The matching wildcard is strict, but no declaration can be found for element 'twitter:search-inbound-channel-adapter'.
org.springframework.beans.factory.xml.XmlBeanDefinitionStoreException: Line 23 in XML document from class path resource [org/springframework/integration/twitter/config/TestSearchReceivingMessageSourceParser-context.xml] is invalid; nested exception is org.xml.sax.SAXParseException; lineNumber: 23; columnNumber: 28; cvc-complex-type.2.4.c: The matching wildcard is strict, but no declaration can be found for element 'twitter:search-inbound-channel-adapter'.
	at org.springframework.beans.factory.xml.XmlBeanDefinitionReader.doLoadBeanDefinitions(XmlBeanDefinitionReader.java:404)
	at org.springframework.beans.factory.xml.XmlBeanDefinitionReader.loadBeanDefinitions(XmlBeanDefinitionReader.java:336)
	at org.springframework.beans.factory.xml.XmlBeanDefinitionReader.loadBeanDefinitions(XmlBeanDefinitionReader.java:304)
	at org.springframework.beans.factory.support.AbstractBeanDefinitionReader.loadBeanDefinitions(AbstractBeanDefinitionReader.java:188)
	at org.springframework.context.support.AbstractXmlApplicationContext.loadBeanDefinitions(AbstractXmlApplicationContext.java:124)
	at org.springframework.context.support.AbstractXmlApplicationContext.loadBeanDefinitions(AbstractXmlApplicationContext.java:94)
(78 more lines...)
Collapse Failed TestSendingMessageHandlerParserTests testSendingMessageHandlerSuccessfulBootstrap History
Default Job < 1 sec
org.springframework.beans.factory.xml.XmlBeanDefinitionStoreException: org.springframework.beans.factory.xml.XmlBeanDefinitionStoreException: Line 21 in XML document from class path resource [org/springframework/integration/twitter/config/TestSendingMessageHandlerParser-context.xml] is invalid; nested exception is org.xml.sax.SAXParseException; lineNumber: 21; columnNumber: 42; cvc-complex-type.2.4.c: The matching wildcard is strict, but no declaration can be found for element 'twitter:dm-outbound-channel-adapter'.
org.springframework.beans.factory.xml.XmlBeanDefinitionStoreException: Line 21 in XML document from class path resource [org/springframework/integration/twitter/config/TestSendingMessageHandlerParser-context.xml] is invalid; nested exception is org.xml.sax.SAXParseException; lineNumber: 21; columnNumber: 42; cvc-complex-type.2.4.c: The matching wildcard is strict, but no declaration can be found for element 'twitter:dm-outbound-channel-adapter'.
	at org.springframework.beans.factory.xml.XmlBeanDefinitionReader.doLoadBeanDefinitions(XmlBeanDefinitionReader.java:404)
	at org.springframework.beans.factory.xml.XmlBeanDefinitionReader.loadBeanDefinitions(XmlBeanDefinitionReader.java:336)
	at org.springframework.beans.factory.xml.XmlBeanDefinitionReader.loadBeanDefinitions(XmlBeanDefinitionReader.java:304)
	at org.springframework.beans.factory.support.AbstractBeanDefinitionReader.loadBeanDefinitions(AbstractBeanDefinitionReader.java:188)
	at org.springframework.context.support.AbstractXmlApplicationContext.loadBeanDefinitions(AbstractXmlApplicationContext.java:124)
	at org.springframework.context.support.AbstractXmlApplicationContext.loadBeanDefinitions(AbstractXmlApplicationContext.java:94)
(78 more lines...)
Collapse Failed TestSendingMessageHandlerParserTests testInt2718FailForOutboundAdapterWithRequestHandlerAdviceChainWithinChainConfig History
Default Job < 1 sec
java.lang.AssertionError: java.lang.AssertionError
java.lang.AssertionError
	at org.junit.Assert.fail(Assert.java:86)
	at org.junit.Assert.assertTrue(Assert.java:41)
	at org.junit.Assert.assertTrue(Assert.java:52)
	at org.springframework.integration.twitter.config.TestSendingMessageHandlerParserTests.testInt2718FailForOutboundAdapterWithRequestHandlerAdviceChainWithinChainConfig(TestSendingMessageHandlerParserTests.java:75)
	at sun.reflect.NativeMethodAccessorImpl.invoke0(Native Method)
	at sun.reflect.NativeMethodAccessorImpl.invoke(NativeMethodAccessorImpl.java:62)
(45 more lines...)
Collapse Failed TwitterSearchOutboundGatewayParserTests testAdvised History
Default Job < 1 sec
java.lang.IllegalStateException: java.lang.IllegalStateException: Failed to load ApplicationContext
java.lang.IllegalStateException: Failed to load ApplicationContext
	at org.springframework.test.context.cache.DefaultCacheAwareContextLoaderDelegate.loadContext(DefaultCacheAwareContextLoaderDelegate.java:125)
	at org.springframework.test.context.support.DefaultTestContext.getApplicationContext(DefaultTestContext.java:108)
	at org.springframework.test.context.support.DependencyInjectionTestExecutionListener.injectDependencies(DependencyInjectionTestExecutionListener.java:118)
	at org.springframework.test.context.support.DependencyInjectionTestExecutionListener.prepareTestInstance(DependencyInjectionTestExecutionListener.java:83)
	at org.springframework.test.context.TestContextManager.prepareTestInstance(TestContextManager.java:246)
	at org.springframework.test.context.junit4.SpringJUnit4ClassRunner.createTest(SpringJUnit4ClassRunner.java:227)
(84 more lines...)
Collapse Failed TwitterSearchOutboundGatewayParserTests testDefault History
Default Job < 1 sec
java.lang.IllegalStateException: java.lang.IllegalStateException: Failed to load ApplicationContext
java.lang.IllegalStateException: Failed to load ApplicationContext
	at org.springframework.test.context.cache.DefaultCacheAwareContextLoaderDelegate.loadContext(DefaultCacheAwareContextLoaderDelegate.java:125)
	at org.springframework.test.context.support.DefaultTestContext.getApplicationContext(DefaultTestContext.java:108)
	at org.springframework.test.context.support.DependencyInjectionTestExecutionListener.injectDependencies(DependencyInjectionTestExecutionListener.java:118)
	at org.springframework.test.context.support.DependencyInjectionTestExecutionListener.prepareTestInstance(DependencyInjectionTestExecutionListener.java:83)
	at org.springframework.test.context.TestContextManager.prepareTestInstance(TestContextManager.java:246)
	at org.springframework.test.context.junit4.SpringJUnit4ClassRunner.createTest(SpringJUnit4ClassRunner.java:227)
(84 more lines...)
Collapse Failed TwitterSearchOutboundGatewayParserTests testAllAtts History
Default Job < 1 sec
java.lang.IllegalStateException: java.lang.IllegalStateException: Failed to load ApplicationContext
java.lang.IllegalStateException: Failed to load ApplicationContext
	at org.springframework.test.context.cache.DefaultCacheAwareContextLoaderDelegate.loadContext(DefaultCacheAwareContextLoaderDelegate.java:125)
	at org.springframework.test.context.support.DefaultTestContext.getApplicationContext(DefaultTestContext.java:108)
	at org.springframework.test.context.support.DependencyInjectionTestExecutionListener.injectDependencies(DependencyInjectionTestExecutionListener.java:118)
	at org.springframework.test.context.support.DependencyInjectionTestExecutionListener.prepareTestInstance(DependencyInjectionTestExecutionListener.java:83)
	at org.springframework.test.context.TestContextManager.prepareTestInstance(TestContextManager.java:246)
	at org.springframework.test.context.junit4.SpringJUnit4ClassRunner.createTest(SpringJUnit4ClassRunner.java:227)
(84 more lines...)
Collapse Failed SearchReceivingMessageSourceWithMetadataTests testPollForTweetsThreeResultsWithHazelcastMetadataStore History
Default Job < 1 sec
java.lang.IllegalStateException: java.lang.IllegalStateException: Failed to load ApplicationContext
java.lang.IllegalStateException: Failed to load ApplicationContext
	at org.springframework.test.context.cache.DefaultCacheAwareContextLoaderDelegate.loadContext(DefaultCacheAwareContextLoaderDelegate.java:125)
	at org.springframework.test.context.support.DefaultTestContext.getApplicationContext(DefaultTestContext.java:108)
	at org.springframework.test.context.support.DependencyInjectionTestExecutionListener.injectDependencies(DependencyInjectionTestExecutionListener.java:118)
	at org.springframework.test.context.support.DependencyInjectionTestExecutionListener.prepareTestInstance(DependencyInjectionTestExecutionListener.java:83)
	at org.springframework.test.context.TestContextManager.prepareTestInstance(TestContextManager.java:246)
	at org.springframework.test.context.junit4.SpringJUnit4ClassRunner.createTest(SpringJUnit4ClassRunner.java:227)
(84 more lines...)
Collapse Failed StatusUpdatingMessageHandlerTests testStatusUpdatingMessageHandler History
Default Job < 1 sec
java.lang.IllegalStateException: java.lang.IllegalStateException: Failed to load ApplicationContext
java.lang.IllegalStateException: Failed to load ApplicationContext
	at org.springframework.test.context.cache.DefaultCacheAwareContextLoaderDelegate.loadContext(DefaultCacheAwareContextLoaderDelegate.java:125)
	at org.springframework.test.context.support.DefaultTestContext.getApplicationContext(DefaultTestContext.java:108)
	at org.springframework.test.context.support.DependencyInjectionTestExecutionListener.injectDependencies(DependencyInjectionTestExecutionListener.java:118)
	at org.springframework.test.context.support.DependencyInjectionTestExecutionListener.prepareTestInstance(DependencyInjectionTestExecutionListener.java:83)
	at org.springframework.test.context.TestContextManager.prepareTestInstance(TestContextManager.java:246)
	at org.springframework.test.context.junit4.SpringJUnit4ClassRunner.createTest(SpringJUnit4ClassRunner.java:227)
(84 more lines...)
Skipped tests 11
Status Test Failing since View job
Skipped TestReceivingUsingNamespace testUpdatesWithRealTwitter History
Default Job
Skipped TestSearchOutboundGateway testSearch History
Default Job
Skipped TestSendingDMsUsingNamespace testSendigRealDirectMessage History
Default Job
Skipped TestSendingDMsUsingNamespace testSendigDirectMessageFromChain History
Default Job
Skipped TestSendingUpdatesUsingNamespace testSendingATweet History
Default Job
Skipped TestSendingUpdatesUsingNamespace testSendingATweetFromChain History
Default Job
Skipped DirectMessageReceivingMessageSourceTests demoReceiveDm History
Default Job
Skipped SearchReceivingMessageSourceTests demoReceiveSearchResults History
Default Job
Skipped TimelineReceivingMessageSourceTests demoReceiveTimeline History
Default Job
Skipped DirectMessageSendingMessageHandlerTests validateSendDirectMessage History
Default Job
Skipped StatusUpdatingMessageHandlerTests demoSendStatusMessage History
Default Job