Build: #21 failed

Job: Default Job failed

Stages & jobs

  1. Default Stage

Job result summary

Completed
Duration
23 seconds
Revision
6e1de98d81f98fd817ca728fa4b33b9450b2c7b2 6e1de98d81f98fd817ca728fa4b33b9450b2c7b2
Fixed in
#22 (Code changes detected)
No failed test found. A possible compilation error occurred.

Error summary

The build generated some errors. See the full build log for more details.

Could not find test result reports in the /opt/bamboo-home/xml-data/build-dir/INTEXT-SIST-JOB1 directory.
20:17:13.970 [ERROR] [system.err] /opt/bamboo-home/xml-data/build-dir/INTEXT-SIST-JOB1/spring-integration-social-twitter/src/main/java/org/springframework/integration/twitter/inbound/AbstractTwitterMessageSource.java:123: error: onInit() in AbstractTwitterMessageSource cannot override onInit() in IntegrationObjectSupport
20:17:13.971 [ERROR] [system.err]         protected void onInit() throws Exception {
20:17:13.971 [ERROR] [system.err]                        ^
20:17:13.971 [ERROR] [system.err]   overridden method does not throw Exception
20:17:14.032 [ERROR] [system.err] /opt/bamboo-home/xml-data/build-dir/INTEXT-SIST-JOB1/spring-integration-social-twitter/src/main/java/org/springframework/integration/twitter/outbound/StatusUpdatingMessageHandler.java:75: error: onInit() in StatusUpdatingMessageHandler cannot override onInit() in AbstractMessageHandler
20:17:14.032 [ERROR] [system.err]         protected void onInit() throws Exception {
20:17:14.032 [ERROR] [system.err]                        ^
20:17:14.032 [ERROR] [system.err]   overridden method does not throw Exception
20:17:14.051 [ERROR] [system.err] 2 errors
20:17:14.064 [ERROR] [org.gradle.internal.buildevents.BuildExceptionReporter]
20:17:14.064 [ERROR] [org.gradle.internal.buildevents.BuildExceptionReporter] FAILURE: Build failed with an exception.
20:17:14.064 [ERROR] [org.gradle.internal.buildevents.BuildExceptionReporter]
20:17:14.064 [ERROR] [org.gradle.internal.buildevents.BuildExceptionReporter] * What went wrong:
20:17:14.064 [ERROR] [org.gradle.internal.buildevents.BuildExceptionReporter] Execution failed for task ':compileJava'.
20:17:14.064 [ERROR] [org.gradle.internal.buildevents.BuildExceptionReporter] > Compilation failed; see the compiler error output for details.
20:17:14.064 [ERROR] [org.gradle.internal.buildevents.BuildExceptionReporter]
20:17:14.064 [ERROR] [org.gradle.internal.buildevents.BuildExceptionReporter] * Try:
20:17:14.064 [ERROR] [org.gradle.internal.buildevents.BuildExceptionReporter] Run with --stacktrace option to get the stack trace.  Run with --scan to get full insights.
20:17:14.064 [ERROR] [org.gradle.internal.buildevents.BuildExceptionReporter]
20:17:14.064 [ERROR] [org.gradle.internal.buildevents.BuildExceptionReporter] * Get more help at https://help.gradle.org
20:17:14.064 [ERROR] [org.gradle.internal.buildevents.BuildResultLogger]
20:17:14.064 [ERROR] [org.gradle.internal.buildevents.BuildResultLogger] BUILD FAILED in 23s