Build: #12 failed

Job: Default Job failed

Stages & jobs

  1. Default Stage

Build log

The build generated 155 lines of output. Download or view full build log

06-Mar-2019 15:40:55 Build Spring Integration Extensions - Spring Integration Splunk - Default Job #12 (INTEXT-SPLUNKSI4-JOB1-12) started building on agent bamboo-01.af.pivotal.io
06-Mar-2019 15:40:55 Remote agent on host bamboo-01.af.pivotal.io
06-Mar-2019 15:40:55 Build working directory is /opt/bamboo-home/xml-data/build-dir/INTEXT-SPLUNKSI4-JOB1
06-Mar-2019 15:40:55 Executing build Spring Integration Extensions - Spring Integration Splunk - Default Job #12 (INTEXT-SPLUNKSI4-JOB1-12)
06-Mar-2019 15:40:55 Starting task 'Checkout Default Repository' of type 'com.atlassian.bamboo.plugins.vcs:task.vcs.checkout'
06-Mar-2019 15:40:55 Build always requires a clean checkout
06-Mar-2019 15:40:55 Cleaning build directory '/opt/bamboo-home/xml-data/build-dir/INTEXT-SPLUNKSI4-JOB1'
06-Mar-2019 15:40:55 Checking out into /opt/bamboo-home/xml-data/build-dir/INTEXT-SPLUNKSI4-JOB1
06-Mar-2019 15:40:55 Updating source code to revision: ddf8c8dd9137048be3cdc4c4a29c61f74562f748
06-Mar-2019 15:40:55 Creating local git repository in '/opt/bamboo-home/xml-data/build-dir/INTEXT-SPLUNKSI4-JOB1/.git'.
06-Mar-2019 15:40:55 Initialized empty Git repository in /opt/bamboo-home/xml-data/build-dir/INTEXT-SPLUNKSI4-JOB1/.git/
06-Mar-2019 15:40:55 Fetching 'refs/heads/master' from 'https://github.com/spring-projects/spring-integration-splunk.git'.
06-Mar-2019 15:40:56 From https://github.com/spring-projects/spring-integration-splunk
06-Mar-2019 15:40:56 * [new branch]      master     -> master
06-Mar-2019 15:40:56 Checking out revision ddf8c8dd9137048be3cdc4c4a29c61f74562f748.
06-Mar-2019 15:40:56 Already on 'master'
06-Mar-2019 15:40:56 Updated source code to revision: ddf8c8dd9137048be3cdc4c4a29c61f74562f748
06-Mar-2019 15:40:56 Finished task 'Checkout Default Repository' with result: Success
06-Mar-2019 15:40:56 Running pre-build action: Artifactory Release Staging
06-Mar-2019 15:40:56 Running pre-build action: VCS Version Collector
06-Mar-2019 15:40:56 Starting task 'Artifactory Gradle' of type 'org.jfrog.bamboo.bamboo-artifactory-plugin:artifactoryGradleTask'
06-Mar-2019 15:40:56 Bamboo Artifactory Plugin version: 2.5.x-SNAPSHOT
06-Mar-2019 15:40:56
Beginning to execute external process for build 'Spring Integration Extensions - Spring Integration Splunk - Default Job #12 (INTEXT-SPLUNKSI4-JOB1-12)'
... running command line:
./gradlew clean build dist -I /tmp/artifactory.init.script4568363115671910939gradle -DbuildInfoConfig.propertiesFile=/tmp/buildinfo2252845056360520210properties artifactoryPublish -Dartifactory.resolve.password=******** -Dartifactory.publish.password=********
... in: /opt/bamboo-home/xml-data/build-dir/INTEXT-SPLUNKSI4-JOB1
... using extra environment variables:
bamboo_planRepository_1_branch=master
IRBRC=/home/bamboo/.rvm/rubies/ruby-2.3.0/.irbrc
bamboo_********_username_password=********
bamboo_signing_store_password=********
bamboo_capability_system_builder_ant_Ant_1_9=/opt/ant-1.9
bamboo_capability_system_builder_ant_Ant_1_8=/opt/ant-1.8
bamboo_planRepository_1_branchDisplayName=master
bamboo_capability_system_jdk_OpenJDK_7u181=/opt/openjdk-7
bamboo_repository_revision_number=ddf8c8dd9137048be3cdc4c4a29c61f74562f748
bamboo_capability_system_builder_node_Node_js_6=/usr/bin/node
bamboo_RIAK_BIN=/usr/sbin/riak
WRAPPER_BITS=32
bamboo_buildKey=INTEXT-SPLUNKSI4-JOB1
rvm_loaded_flag=1
bamboo_bintray_password=********
bamboo_repository_159744050_git_branch=master
bamboo_sonar_token_password=********
rvm_version=1.27.0 (latest)
PWD=/opt/bamboo-home/bin
bamboo_shortJobName=Default Job
bamboo_capability_system_builder_gradle___gradlew=./gradlew
bamboo_buildResultsUrl=https://build.spring.io/browse/INTEXT-SPLUNKSI4-JOB1-12
bamboo_capability_system_builder_mvn3_Maven_3_3=/opt/maven-3.3
bamboo_capability_system_builder_mvn3_Maven_3_2=/opt/maven-3.2
bamboo_capability_system_builder_mvn3_Maven_3_1=/opt/maven-3.1
bamboo_planRepository_repositoryUrl=https://github.com/spring-projects/spring-integration-splunk.git
bamboo_repository_159744050_previous_revision_number=ddf8c8dd9137048be3cdc4c4a29c61f74562f748
bamboo_agentId=208568322
bamboo_capability_system_builder_mvn3_Maven_3_5=/opt/maven-3.5
bamboo_repository_159744050_name=Spring Integration Splunk
MY_RUBY_HOME=/home/bamboo/.rvm/rubies/ruby-2.3.0
bamboo_capability_system_builder_mvn3_Maven_3_0=/opt/maven-3.0
rvm_path=/home/bamboo/.rvm
bamboo_planRepository_revision=ddf8c8dd9137048be3cdc4c4a29c61f74562f748
bamboo_planRepository_previousRevision=ddf8c8dd9137048be3cdc4c4a29c61f74562f748
bamboo_capability_remote_build=true
bamboo_repository_branch_name=master
bamboo_sonatype_token_password=********
SHLVL=1
bamboo_repository_159744050_git_repositoryUrl=https://github.com/spring-projects/spring-integration-splunk.git
bamboo_org_jfrog_bamboo_buildInfo_serverUrl=https://repo.spring.io
bamboo_scdf_acceptance_tests_password=********
WRAPPER_OS=linux
JAVA_HOME=/opt/jdk-7/
bamboo_dependenciesDisabled=false
EC2_HOME=/opt/ec2-api-tools
XDG_SESSION_ID=c1
bamboo_repository_159744050_branch_name=master
bamboo_capability_Agent=bamboo-01.af.pivotal.io
bamboo_planRepository_branch=master
bamboo_org_jfrog_bamboo_release_activated=false
bamboo_repository_159744050_revision_number=ddf8c8dd9137048be3cdc4c4a29c61f74562f748
bamboo_planRepository_1_type=gitv2
bamboo_planRepository_branchName=master
WRAPPER_FILE_SEPARATOR=/
_=/opt/bamboo-home/bin/bamboo-agent.sh
WRAPPER_PATH_SEPARATOR=:
bamboo_sonar_password=********
bamboo_hg_cache_directory=/opt/bamboo-home/xml-data/build-dir/_hg-repositories-cache
bamboo_planRepository_1_username=spring-buildmaster
bamboo_planRepository_type=gitv2
bamboo_ManualBuildTriggerReason_userName=abilan
bamboo_git_cache_directory=/opt/bamboo-home/xml-data/build-dir/_git-repositories-cache
bamboo_artifactory_username=buildmaster
rvm_stored_umask=0002
bamboo_tmp_directory=/opt/bamboo-home/temp
GEM_PATH=/home/bamboo/.rvm/gems/ruby-2.3.0:/home/bamboo/.rvm/gems/[email protected]
bamboo_planKey=INTEXT-SPLUNKSI4
bamboo_planRepository_username=spring-buildmaster
bamboo_JDK8_HOME=/opt/jdk-8
NLSPATH=/usr/dt/lib/nls/msg/%L/%N.cat
bamboo_repository_159744050_git_username=spring-buildmaster
bamboo_planRepository_1_branchName=master
bamboo_sonar_version=5.6.3
XDG_DATA_DIRS=/usr/local/share:/usr/share:/var/lib/snapd/desktop
bamboo_capability_system_jdk_JDK_1_11=/opt/jdk-11
bamboo_resultsUrl=https://build.spring.io/browse/INTEXT-SPLUNKSI4-JOB1-12
bamboo_capability_system_jdk_JDK_1_10=/opt/jdk-10
bamboo_build_working_directory=/opt/bamboo-home/xml-data/build-dir/INTEXT-SPLUNKSI4-JOB1
bamboo_planRepository_1_name=Spring Integration Splunk
bamboo_capability_system_os=ubuntu1604
bamboo_nexusPush_stagingProfile=buildmaster
bamboo_shortPlanName=Spring Integration Splunk
MAIL=/var/mail/bamboo
bamboo_planRepository_name=Spring Integration Splunk
LOGNAME=bamboo
bamboo_buildNumber=12
rvm_user_install_flag=1
SHELL=/bin/bash
bamboo_planName=Spring Integration Extensions - Spring Integration Splunk
bamboo_JDK7_HOME=/opt/jdk-7
bamboo_shortPlanKey=SPLUNKSI4
OLDPWD=/opt/users/bamboo
GEM_HOME=/home/bamboo/.rvm/gems/ruby-2.3.0
bamboo_shortJobKey=JOB1
bamboo_artifactory_password=********
bamboo_buildTimeStamp=2019-03-06T15:40:55.294Z
bamboo_repository_previous_revision_number=ddf8c8dd9137048be3cdc4c4a29c61f74562f748
RUBY_VERSION=ruby-2.3.0
bamboo_sonar_username=buildmaster
_system_name=Ubuntu
bamboo_********_password=********
bamboo_repository_git_branch=master
bamboo_buildResultKey=INTEXT-SPLUNKSI4-JOB1-12
bamboo_nexusPush_close=true
bamboo_buildPlanName=Spring Integration Extensions - Spring Integration Splunk - Default Job
bamboo_planRepository_1_revision=ddf8c8dd9137048be3cdc4c4a29c61f74562f748
_system_arch=x86_64
bamboo_repository_name=Spring Integration Splunk
rvm_bin_path=/home/bamboo/.rvm/bin
bamboo_signing_key_password=********
XFILESEARCHPATH=/usr/dt/app-defaults/%L/Dt
rvm_prefix=/home/bamboo
LANG=en_US.UTF-8
bamboo_buildFailed=false
bamboo_capability_system_docker_executable=/usr/bin/docker
DISPLAY=localhost:1.0
bamboo_capability_system_builder_groovy_Groovy_2_4=/opt/groovy-2.4
bamboo_artifactory_password_mask_b=********
bamboo_capability_system_builder_command_Bash=/bin/bash
bamboo_artifactory_password_mask_a=********
bamboo_agentWorkingDirectory=/opt/bamboo-home/xml-data/build-dir
bamboo_capability_system_git_executable=/usr/bin/git
bamboo_repository_git_username=spring-buildmaster
bamboo_planRepository_1_previousRevision=ddf8c8dd9137048be3cdc4c4a29c61f74562f748
bamboo_capability_os_family=unix
NVM_NODEJS_ORG_MIRROR=http://nodejs.org/dist
bamboo_planRepository_branchDisplayName=master
NODE_PATH=/usr/lib/nodejs:/usr/lib/node_modules:/usr/share/javascript
bamboo_capability_system_builder_maven_Artifactory_Maven_3_5=/opt/maven-3.5
GIT_SSL_NO_VERIFY=true
bamboo_capability_system_builder_maven_Artifactory_Maven_3_3=/opt/maven-3.3
NVM_DIR=/home/bamboo/.nvm
bamboo_capability_system_builder_maven_Artifactory_Maven_3_2=/opt/maven-3.2
bamboo_s3_properties=/home/bamboo/tools/s3.properties
bamboo_capability_system_builder_maven_Artifactory_Maven_3_1=/opt/maven-3.1
bamboo_capability_system_builder_maven_Artifactory_Maven_3_0=/opt/maven-3.0
_system_type=Linux
bamboo_plan_storageTag=INTEXT-SPLUNKSI4
bamboo_bintray_username_password=********
_system_version=16.04
USER=bamboo
bamboo_repository_git_repositoryUrl=https://github.com/spring-projects/spring-integration-splunk.git
bamboo_working_directory=/opt/bamboo-home/xml-data/build-dir/INTEXT-SPLUNKSI4-JOB1
bamboo_org_jfrog_bamboo_buildInfo_activated=true
bamboo_planRepository_1_repositoryUrl=https://github.com/spring-projects/spring-integration-splunk.git
bamboo_capability_system_jdk_JDK_1_8=/opt/jdk-8
bamboo_capability_system_jdk_JDK_1_9=/opt/jdk-9
WRAPPER_ARCH=x86
bamboo_capability_system_jdk_JDK_1_6=/opt/jdk-6
bamboo_sonatype_password=********
bamboo_capability_system_jdk_JDK_1_7=/opt/jdk-7
bamboo_sonar_ip=10.194.6.9
XDG_RUNTIME_DIR=/run/user/505
HOME=/home/bamboo
PATH=/bin:/home/bamboo/.rvm/gems/ruby-2.3.0/bin:/home/bamboo/.rvm/gems/[email protected]/bin:/home/bamboo/.rvm/rubies/ruby-2.3.0/bin:/home/bamboo/bin:/usr/local/bin:/usr/bin:/bin:/usr/local/games:/usr/games:/snap/bin:/home/bamboo/bin:/usr/local/bin:/opt/ec2-api-tools/bin:/home/bamboo/.rvm/bin:/bin:/home/bamboo/.rvm/gems/ruby-2.3.0/bin:/home/bamboo/.rvm/gems/[email protected]/bin:/home/bamboo/.rvm/rubies/ruby-2.3.0/bin:/home/bamboo/bin:/usr/local/bin:/usr/bin:/bin:/usr/local/games:/usr/games:/snap/bin:/home/bamboo/bin:/usr/local/bin:/opt/ec2-api-tools/bin:/home/bamboo/.rvm/bin
06-Mar-2019 15:40:57 Downloading http://services.gradle.org/distributions/gradle-1.12-all.zip
06-Mar-2019 15:40:58 ..................................................................................................................................................................................................................................................................................................................................................................................................................................................................................................................................................................................................................................................................................................................................................................................................................................................................................................................................................................................................................................................................................................................................................................................................................................................................................................................................................................................................................................................................................................................................................................................................................................................................................................................................................................................................................................................................................................................................................................................................................................................................................................................................................................................................................................................................................................................................................................................................................................................................................................................................................................................................................................................................................................................................................................................................................................................................................................................................................................................................
06-Mar-2019 15:40:58 Unzipping /home/bamboo/.gradle/wrapper/dists/gradle-1.12-all/2apkk7d25miauqf1pdjp1bm0uo/gradle-1.12-all.zip to /home/bamboo/.gradle/wrapper/dists/gradle-1.12-all/2apkk7d25miauqf1pdjp1bm0uo
06-Mar-2019 15:40:59 Set executable permissions for: /home/bamboo/.gradle/wrapper/dists/gradle-1.12-all/2apkk7d25miauqf1pdjp1bm0uo/gradle-1.12/bin/gradle
06-Mar-2019 15:41:04
06-Mar-2019 15:41:04 FAILURE: Build failed with an exception.
06-Mar-2019 15:41:04
06-Mar-2019 15:41:04 * What went wrong:
06-Mar-2019 15:41:04 A problem occurred configuring root project 'spring-integration-splunk'.
06-Mar-2019 15:41:04 > Could not resolve all dependencies for configuration ':classpath'.
06-Mar-2019 15:41:04    > Could not resolve io.spring.gradle:docbook-reference-plugin:0.3.1.
06-Mar-2019 15:41:04      Required by:
06-Mar-2019 15:41:04          :spring-integration-splunk:1.2.0.BUILD-SNAPSHOT
06-Mar-2019 15:41:04       > Could not HEAD 'https://repo.spring.io/plugins-release/io/spring/gradle/docbook-reference-plugin/0.3.1/docbook-reference-plugin-0.3.1.pom'.
06-Mar-2019 15:41:04          > peer not authenticated
06-Mar-2019 15:41:04    > Could not resolve io.spring.gradle:spring-io-plugin:0.0.4.RELEASE.
06-Mar-2019 15:41:04      Required by:
06-Mar-2019 15:41:04          :spring-integration-splunk:1.2.0.BUILD-SNAPSHOT
06-Mar-2019 15:41:04       > Could not GET 'https://repo.spring.io/plugins-release/io/spring/gradle/spring-io-plugin/0.0.4.RELEASE/spring-io-plugin-0.0.4.RELEASE.pom'.
06-Mar-2019 15:41:04          > peer not authenticated
06-Mar-2019 15:41:04
06-Mar-2019 15:41:04 * Try:
06-Mar-2019 15:41:04 Run with --stacktrace option to get the stack trace. Run with --info or --debug option to get more log output.
06-Mar-2019 15:41:04
06-Mar-2019 15:41:04 BUILD FAILED
06-Mar-2019 15:41:04
06-Mar-2019 15:41:04 Total time: 7.782 secs
06-Mar-2019 15:41:05
06-Mar-2019 15:41:05 Failing task since return code of [./gradlew clean build dist -I /tmp/artifactory.init.script4568363115671910939gradle -DbuildInfoConfig.propertiesFile=/tmp/buildinfo2252845056360520210properties artifactoryPublish -Dartifactory.resolve.password=******** -Dartifactory.publish.password=********] was 1 while expected 0
06-Mar-2019 15:41:05 Parsing test results under /opt/bamboo-home/xml-data/build-dir/INTEXT-SPLUNKSI4-JOB1...
06-Mar-2019 15:41:05 Finished task 'Artifactory Gradle' with result: Failed
06-Mar-2019 15:41:05 Running post build plugin 'Docker Container Cleanup'
06-Mar-2019 15:41:05 Running post build plugin 'NCover Results Collector'
06-Mar-2019 15:41:05 Running post build plugin 'Artifactory Release Management Staging'
06-Mar-2019 15:41:05 Running post build plugin 'Artifactory Build Info Copier'
06-Mar-2019 15:41:05 Running post build plugin 'Artifactory Gradle Properties Info Copier'
06-Mar-2019 15:41:05 Running post build plugin 'Clover Results Collector'
06-Mar-2019 15:41:05 Running post build plugin 'npm Cache Cleanup'
06-Mar-2019 15:41:05 Running post build plugin 'Artifact Copier'
06-Mar-2019 15:41:05 Publishing an artifact: Test Results
06-Mar-2019 15:41:05 Finished publishing of artifact Job artifact: [Test Results], pattern: [build/reports/*tests/**/*.*] in 3.843 ms
06-Mar-2019 15:41:05 Finalising the build...
06-Mar-2019 15:41:05 Stopping timer.
06-Mar-2019 15:41:05 Build INTEXT-SPLUNKSI4-JOB1-12 completed.
06-Mar-2019 15:41:05 Running on server: post build plugin 'NCover Results Collector'
06-Mar-2019 15:41:05 Running on server: post build plugin 'Build Hanging Detection Configuration'
06-Mar-2019 15:41:05 Running on server: post build plugin 'Clover Delta Calculator'
06-Mar-2019 15:41:05 Running on server: post build plugin 'Maven Dependencies Postprocessor'
06-Mar-2019 15:41:05 All post build plugins have finished
06-Mar-2019 15:41:05 Generating build results summary...
06-Mar-2019 15:41:05 Saving build results to disk...
06-Mar-2019 15:41:05 Logging substituted variables...
06-Mar-2019 15:41:05 Indexing build results...
06-Mar-2019 15:41:05 Finished building INTEXT-SPLUNKSI4-JOB1-12.
06-Mar-2019 15:42:13 Build Spring Integration Extensions - Spring Integration Splunk - Default Job #12 (INTEXT-SPLUNKSI4-JOB1-12) started building on agent bamboo-14.af.pivotal.io
06-Mar-2019 15:42:13 Remote agent on host bamboo-14.af.pivotal.io
06-Mar-2019 15:42:13 Build working directory is /opt/bamboo-home/xml-data/build-dir/INTEXT-SPLUNKSI4-JOB1
06-Mar-2019 15:42:13 Executing build Spring Integration Extensions - Spring Integration Splunk - Default Job #12 (INTEXT-SPLUNKSI4-JOB1-12)
06-Mar-2019 15:42:13 Starting task 'Checkout Default Repository' of type 'com.atlassian.bamboo.plugins.vcs:task.vcs.checkout'
06-Mar-2019 15:42:13 Build always requires a clean checkout
06-Mar-2019 15:42:13 Cleaning build directory '/opt/bamboo-home/xml-data/build-dir/INTEXT-SPLUNKSI4-JOB1'
06-Mar-2019 15:42:13 Checking out into /opt/bamboo-home/xml-data/build-dir/INTEXT-SPLUNKSI4-JOB1
06-Mar-2019 15:42:13 Updating source code to revision: ddf8c8dd9137048be3cdc4c4a29c61f74562f748
06-Mar-2019 15:42:13 Creating local git repository in '/opt/bamboo-home/xml-data/build-dir/INTEXT-SPLUNKSI4-JOB1/.git'.
06-Mar-2019 15:42:13 Initialized empty Git repository in /opt/bamboo-home/xml-data/build-dir/INTEXT-SPLUNKSI4-JOB1/.git/
06-Mar-2019 15:42:14 Fetching 'refs/heads/master' from 'https://github.com/spring-projects/spring-integration-splunk.git'.
06-Mar-2019 15:42:16 From https://github.com/spring-projects/spring-integration-splunk
06-Mar-2019 15:42:16 * [new branch]      master     -> master
06-Mar-2019 15:42:16 Checking out revision ddf8c8dd9137048be3cdc4c4a29c61f74562f748.
06-Mar-2019 15:42:16 Already on 'master'
06-Mar-2019 15:42:16 Updated source code to revision: ddf8c8dd9137048be3cdc4c4a29c61f74562f748
06-Mar-2019 15:42:16 Finished task 'Checkout Default Repository' with result: Success
06-Mar-2019 15:42:16 Running pre-build action: Artifactory Release Staging
06-Mar-2019 15:42:16 Running pre-build action: VCS Version Collector
06-Mar-2019 15:42:16 Starting task 'Artifactory Gradle' of type 'org.jfrog.bamboo.bamboo-artifactory-plugin:artifactoryGradleTask'
06-Mar-2019 15:42:16 Bamboo Artifactory Plugin version: 2.5.x-SNAPSHOT
06-Mar-2019 15:42:16
Beginning to execute external process for build 'Spring Integration Extensions - Spring Integration Splunk - Default Job #12 (INTEXT-SPLUNKSI4-JOB1-12)'
... running command line:
./gradlew clean build dist -I /tmp/artifactory.init.script2443857411907322083gradle -DbuildInfoConfig.propertiesFile=/tmp/buildinfo6735265343501212381properties artifactoryPublish -Dartifactory.resolve.password=******** -Dartifactory.publish.password=********
... in: /opt/bamboo-home/xml-data/build-dir/INTEXT-SPLUNKSI4-JOB1
... using extra environment variables:
bamboo_planRepository_1_branch=master
IRBRC=/home/bamboo/.rvm/rubies/ruby-2.3.0/.irbrc
bamboo_********_username_password=********
bamboo_signing_store_password=********
bamboo_capability_system_builder_ant_Ant_1_9=/opt/ant-1.9
bamboo_capability_system_builder_ant_Ant_1_8=/opt/ant-1.8
bamboo_planRepository_1_branchDisplayName=master
bamboo_capability_system_jdk_OpenJDK_7u181=/opt/openjdk-7
bamboo_repository_revision_number=ddf8c8dd9137048be3cdc4c4a29c61f74562f748
bamboo_capability_system_builder_node_Node_js_6=/usr/bin/node
bamboo_RIAK_BIN=/usr/sbin/riak
WRAPPER_BITS=32
bamboo_buildKey=INTEXT-SPLUNKSI4-JOB1
rvm_loaded_flag=1
bamboo_bintray_password=********
bamboo_repository_159744050_git_branch=master
bamboo_sonar_token_password=********
rvm_version=1.27.0 (latest)
PWD=/opt/bamboo-home/bin
bamboo_shortJobName=Default Job
bamboo_capability_system_builder_gradle___gradlew=./gradlew
bamboo_buildResultsUrl=https://build.spring.io/browse/INTEXT-SPLUNKSI4-JOB1-12
bamboo_capability_system_builder_mvn3_Maven_3_3=/opt/maven-3.3
bamboo_capability_system_builder_mvn3_Maven_3_2=/opt/maven-3.2
bamboo_capability_system_builder_mvn3_Maven_3_1=/opt/maven-3.1
bamboo_planRepository_repositoryUrl=https://github.com/spring-projects/spring-integration-splunk.git
bamboo_repository_159744050_previous_revision_number=ddf8c8dd9137048be3cdc4c4a29c61f74562f748
bamboo_agentId=208568330
bamboo_capability_system_builder_mvn3_Maven_3_5=/opt/maven-3.5
bamboo_repository_159744050_name=Spring Integration Splunk
MY_RUBY_HOME=/home/bamboo/.rvm/rubies/ruby-2.3.0
bamboo_capability_system_builder_mvn3_Maven_3_0=/opt/maven-3.0
rvm_path=/home/bamboo/.rvm
bamboo_planRepository_revision=ddf8c8dd9137048be3cdc4c4a29c61f74562f748
bamboo_planRepository_previousRevision=ddf8c8dd9137048be3cdc4c4a29c61f74562f748
bamboo_capability_remote_build=true
bamboo_repository_branch_name=master
bamboo_sonatype_token_password=********
SHLVL=1
bamboo_repository_159744050_git_repositoryUrl=https://github.com/spring-projects/spring-integration-splunk.git
bamboo_org_jfrog_bamboo_buildInfo_serverUrl=https://repo.spring.io
bamboo_scdf_acceptance_tests_password=********
WRAPPER_OS=linux
JAVA_HOME=/opt/jdk-7/
bamboo_dependenciesDisabled=false
EC2_HOME=/opt/ec2-api-tools
XDG_SESSION_ID=c1
bamboo_repository_159744050_branch_name=master
bamboo_capability_Agent=bamboo-14.af.pivotal.io
bamboo_planRepository_branch=master
bamboo_org_jfrog_bamboo_release_activated=false
bamboo_repository_159744050_revision_number=ddf8c8dd9137048be3cdc4c4a29c61f74562f748
bamboo_planRepository_1_type=gitv2
bamboo_planRepository_branchName=master
WRAPPER_FILE_SEPARATOR=/
_=/opt/bamboo-home/bin/bamboo-agent.sh
WRAPPER_PATH_SEPARATOR=:
bamboo_sonar_password=********
bamboo_hg_cache_directory=/opt/bamboo-home/xml-data/build-dir/_hg-repositories-cache
bamboo_planRepository_1_username=spring-buildmaster
bamboo_planRepository_type=gitv2
bamboo_ManualBuildTriggerReason_userName=abilan
bamboo_git_cache_directory=/opt/bamboo-home/xml-data/build-dir/_git-repositories-cache
bamboo_artifactory_username=buildmaster
rvm_stored_umask=0002
bamboo_tmp_directory=/opt/bamboo-home/temp
GEM_PATH=/home/bamboo/.rvm/gems/ruby-2.3.0:/home/bamboo/.rvm/gems/[email protected]
bamboo_planKey=INTEXT-SPLUNKSI4
bamboo_planRepository_username=spring-buildmaster
bamboo_JDK8_HOME=/opt/jdk-8
NLSPATH=/usr/dt/lib/nls/msg/%L/%N.cat
bamboo_repository_159744050_git_username=spring-buildmaster
bamboo_planRepository_1_branchName=master
bamboo_sonar_version=5.6.3
XDG_DATA_DIRS=/usr/local/share:/usr/share:/var/lib/snapd/desktop
bamboo_capability_system_jdk_JDK_1_11=/opt/jdk-11
bamboo_resultsUrl=https://build.spring.io/browse/INTEXT-SPLUNKSI4-JOB1-12
bamboo_capability_system_jdk_JDK_1_10=/opt/jdk-10
bamboo_build_working_directory=/opt/bamboo-home/xml-data/build-dir/INTEXT-SPLUNKSI4-JOB1
bamboo_planRepository_1_name=Spring Integration Splunk
bamboo_capability_system_os=ubuntu1604
bamboo_nexusPush_stagingProfile=buildmaster
bamboo_shortPlanName=Spring Integration Splunk
MAIL=/var/mail/bamboo
bamboo_planRepository_name=Spring Integration Splunk
LOGNAME=bamboo
bamboo_buildNumber=12
rvm_user_install_flag=1
SHELL=/bin/bash
bamboo_ManualBuildTriggerReason_stageName=Default Stage
bamboo_planName=Spring Integration Extensions - Spring Integration Splunk
bamboo_JDK7_HOME=/opt/jdk-7
bamboo_shortPlanKey=SPLUNKSI4
OLDPWD=/opt/users/bamboo
GEM_HOME=/home/bamboo/.rvm/gems/ruby-2.3.0
bamboo_shortJobKey=JOB1
bamboo_artifactory_password=********
bamboo_buildTimeStamp=2019-03-06T15:42:13.816Z
bamboo_repository_previous_revision_number=ddf8c8dd9137048be3cdc4c4a29c61f74562f748
RUBY_VERSION=ruby-2.3.0
bamboo_sonar_username=buildmaster
_system_name=Ubuntu
bamboo_********_password=********
bamboo_repository_git_branch=master
bamboo_buildResultKey=INTEXT-SPLUNKSI4-JOB1-12
bamboo_nexusPush_close=true
bamboo_buildPlanName=Spring Integration Extensions - Spring Integration Splunk - Default Job
bamboo_planRepository_1_revision=ddf8c8dd9137048be3cdc4c4a29c61f74562f748
bamboo_build_commandline_org_jfrog_bamboo_bamboo_artifactory_plugin_artifactoryGradleTask_4=./gradlew clean build dist -I /tmp/artifactory.init.script4568363115671910939gradle -DbuildInfoConfig.propertiesFile=/tmp/buildinfo2252845056360520210properties artifactoryPublish -Dartifactory.resolve.password=******** -Dartifactory.publish.password=********
_system_arch=x86_64
bamboo_repository_name=Spring Integration Splunk
rvm_bin_path=/home/bamboo/.rvm/bin
bamboo_signing_key_password=********
XFILESEARCHPATH=/usr/dt/app-defaults/%L/Dt
rvm_prefix=/home/bamboo
LANG=en_US.UTF-8
bamboo_buildFailed=false
bamboo_capability_system_docker_executable=/usr/bin/docker
DISPLAY=localhost:1.0
bamboo_capability_system_builder_groovy_Groovy_2_4=/opt/groovy-2.4
bamboo_artifactory_password_mask_b=********
bamboo_capability_system_builder_command_Bash=/bin/bash
bamboo_artifactory_password_mask_a=********
bamboo_agentWorkingDirectory=/opt/bamboo-home/xml-data/build-dir
bamboo_capability_system_git_executable=/usr/bin/git
bamboo_repository_git_username=spring-buildmaster
bamboo_planRepository_1_previousRevision=ddf8c8dd9137048be3cdc4c4a29c61f74562f748
bamboo_capability_os_family=unix
NVM_NODEJS_ORG_MIRROR=http://nodejs.org/dist
bamboo_planRepository_branchDisplayName=master
NODE_PATH=/usr/lib/nodejs:/usr/lib/node_modules:/usr/share/javascript
bamboo_capability_system_builder_maven_Artifactory_Maven_3_5=/opt/maven-3.5
GIT_SSL_NO_VERIFY=true
bamboo_capability_system_builder_maven_Artifactory_Maven_3_3=/opt/maven-3.3
NVM_DIR=/home/bamboo/.nvm
bamboo_capability_system_builder_maven_Artifactory_Maven_3_2=/opt/maven-3.2
bamboo_s3_properties=/home/bamboo/tools/s3.properties
bamboo_capability_system_builder_maven_Artifactory_Maven_3_1=/opt/maven-3.1
bamboo_capability_system_builder_maven_Artifactory_Maven_3_0=/opt/maven-3.0
_system_type=Linux
bamboo_plan_storageTag=INTEXT-SPLUNKSI4
bamboo_bintray_username_password=********
_system_version=16.04
USER=bamboo
bamboo_repository_git_repositoryUrl=https://github.com/spring-projects/spring-integration-splunk.git
bamboo_working_directory=/opt/bamboo-home/xml-data/build-dir/INTEXT-SPLUNKSI4-JOB1
bamboo_org_jfrog_bamboo_buildInfo_activated=true
bamboo_RerunBuildTriggerReason_noOfRetries=1
bamboo_planRepository_1_repositoryUrl=https://github.com/spring-projects/spring-integration-splunk.git
bamboo_capability_system_jdk_JDK_1_8=/opt/jdk-8
bamboo_capability_system_jdk_JDK_1_9=/opt/jdk-9
WRAPPER_ARCH=x86
bamboo_capability_system_jdk_JDK_1_6=/opt/jdk-6
bamboo_sonatype_password=********
bamboo_capability_system_jdk_JDK_1_7=/opt/jdk-7
bamboo_sonar_ip=10.194.6.9
XDG_RUNTIME_DIR=/run/user/505
HOME=/home/bamboo
PATH=/bin:/home/bamboo/.rvm/gems/ruby-2.3.0/bin:/home/bamboo/.rvm/gems/[email protected]/bin:/home/bamboo/.rvm/rubies/ruby-2.3.0/bin:/home/bamboo/bin:/usr/local/bin:/usr/bin:/bin:/usr/local/games:/usr/games:/snap/bin:/home/bamboo/bin:/usr/local/bin:/opt/ec2-api-tools/bin:/home/bamboo/.rvm/bin:/bin:/home/bamboo/.rvm/gems/ruby-2.3.0/bin:/home/bamboo/.rvm/gems/[email protected]/bin:/home/bamboo/.rvm/rubies/ruby-2.3.0/bin:/home/bamboo/bin:/usr/local/bin:/usr/bin:/bin:/usr/local/games:/usr/games:/snap/bin:/home/bamboo/bin:/usr/local/bin:/opt/ec2-api-tools/bin:/home/bamboo/.rvm/bin
06-Mar-2019 15:42:16 Downloading http://services.gradle.org/distributions/gradle-1.12-all.zip
06-Mar-2019 15:42:17 ..................................................................................................................................................................................................................................................................................................................................................................................................................................................................................................................................................................................................................................................................................................................................................................................................................................................................................................................................................................................................................................................................................................................................................................................................................................................................................................................................................................................................................................................................................................................................................................................................................................................................................................................................................................................................................................................................................................................................................................................................................................................................................................................................................................................................................................................................................................................................................................................................................................................................................................................................................................................................................................................................................................................................................................................................................................................................................................................................................................................................
06-Mar-2019 15:42:17 Unzipping /home/bamboo/.gradle/wrapper/dists/gradle-1.12-all/2apkk7d25miauqf1pdjp1bm0uo/gradle-1.12-all.zip to /home/bamboo/.gradle/wrapper/dists/gradle-1.12-all/2apkk7d25miauqf1pdjp1bm0uo
06-Mar-2019 15:42:19 Set executable permissions for: /home/bamboo/.gradle/wrapper/dists/gradle-1.12-all/2apkk7d25miauqf1pdjp1bm0uo/gradle-1.12/bin/gradle
06-Mar-2019 15:42:23
06-Mar-2019 15:42:23 FAILURE: Build failed with an exception.
06-Mar-2019 15:42:23
06-Mar-2019 15:42:23 * What went wrong:
06-Mar-2019 15:42:23 A problem occurred configuring root project 'spring-integration-splunk'.
06-Mar-2019 15:42:23 > Could not resolve all dependencies for configuration ':classpath'.
06-Mar-2019 15:42:23    > Could not resolve io.spring.gradle:docbook-reference-plugin:0.3.1.
06-Mar-2019 15:42:23      Required by:
06-Mar-2019 15:42:23          :spring-integration-splunk:1.2.0.BUILD-SNAPSHOT
06-Mar-2019 15:42:23       > Could not HEAD 'https://repo.spring.io/plugins-release/io/spring/gradle/docbook-reference-plugin/0.3.1/docbook-reference-plugin-0.3.1.pom'.
06-Mar-2019 15:42:23          > peer not authenticated
06-Mar-2019 15:42:23    > Could not resolve io.spring.gradle:spring-io-plugin:0.0.4.RELEASE.
06-Mar-2019 15:42:23      Required by:
06-Mar-2019 15:42:23          :spring-integration-splunk:1.2.0.BUILD-SNAPSHOT
06-Mar-2019 15:42:23       > Could not HEAD 'https://repo.spring.io/plugins-release/io/spring/gradle/spring-io-plugin/0.0.4.RELEASE/spring-io-plugin-0.0.4.RELEASE.pom'.
06-Mar-2019 15:42:23          > peer not authenticated
06-Mar-2019 15:42:23
06-Mar-2019 15:42:23 * Try:
06-Mar-2019 15:42:23 Run with --stacktrace option to get the stack trace. Run with --info or --debug option to get more log output.
06-Mar-2019 15:42:23
06-Mar-2019 15:42:23 BUILD FAILED
06-Mar-2019 15:42:23
06-Mar-2019 15:42:23 Total time: 7.436 secs
06-Mar-2019 15:42:24
06-Mar-2019 15:42:24 Failing task since return code of [./gradlew clean build dist -I /tmp/artifactory.init.script2443857411907322083gradle -DbuildInfoConfig.propertiesFile=/tmp/buildinfo6735265343501212381properties artifactoryPublish -Dartifactory.resolve.password=******** -Dartifactory.publish.password=********] was 1 while expected 0
06-Mar-2019 15:42:24 Parsing test results under /opt/bamboo-home/xml-data/build-dir/INTEXT-SPLUNKSI4-JOB1...
06-Mar-2019 15:42:24 Finished task 'Artifactory Gradle' with result: Failed
06-Mar-2019 15:42:24 Running post build plugin 'Docker Container Cleanup'
06-Mar-2019 15:42:24 Running post build plugin 'NCover Results Collector'
06-Mar-2019 15:42:24 Running post build plugin 'Artifactory Release Management Staging'
06-Mar-2019 15:42:24 Running post build plugin 'Artifactory Build Info Copier'
06-Mar-2019 15:42:24 Running post build plugin 'Artifactory Gradle Properties Info Copier'
06-Mar-2019 15:42:24 Unable to publish artifact [gradle]:
06-Mar-2019 15:42:24 Running post build plugin 'Clover Results Collector'
06-Mar-2019 15:42:24 Running post build plugin 'npm Cache Cleanup'
06-Mar-2019 15:42:24 Running post build plugin 'Artifact Copier'
06-Mar-2019 15:42:24 Publishing an artifact: Test Results
06-Mar-2019 15:42:24 Finished publishing of artifact Job artifact: [Test Results], pattern: [build/reports/*tests/**/*.*] in 5.345 ms
06-Mar-2019 15:42:24 Finalising the build...
06-Mar-2019 15:42:24 Stopping timer.
06-Mar-2019 15:42:24 Build INTEXT-SPLUNKSI4-JOB1-12 completed.
06-Mar-2019 15:42:41 Running on server: post build plugin 'NCover Results Collector'
06-Mar-2019 15:42:41 Running on server: post build plugin 'Build Hanging Detection Configuration'
06-Mar-2019 15:42:41 Running on server: post build plugin 'Clover Delta Calculator'
06-Mar-2019 15:42:41 Running on server: post build plugin 'Maven Dependencies Postprocessor'
06-Mar-2019 15:42:41 All post build plugins have finished
06-Mar-2019 15:42:41 Generating build results summary...
06-Mar-2019 15:42:41 Saving build results to disk...
06-Mar-2019 15:42:41 Logging substituted variables...
06-Mar-2019 15:42:41 Indexing build results...
06-Mar-2019 15:42:41 Finished building INTEXT-SPLUNKSI4-JOB1-12.