Build: #4 failed

Job: Default Job failed

Stages & jobs

  1. Default Stage

Build log

The build generated 201 lines of output. Download or view full build log

06-Mar-2019 15:04:34 Build Spring Integration Extensions - Spring Integration Voldemort - Default Job #4 (INTEXT-VOLDEMORT-JOB1-4) started building on agent bamboo-00.af.pivotal.io
06-Mar-2019 15:04:34 Remote agent on host bamboo-00.af.pivotal.io
06-Mar-2019 15:04:34 Build working directory is /opt/bamboo-home/xml-data/build-dir/INTEXT-VOLDEMORT-JOB1
06-Mar-2019 15:04:34 Executing build Spring Integration Extensions - Spring Integration Voldemort - Default Job #4 (INTEXT-VOLDEMORT-JOB1-4)
06-Mar-2019 15:04:34 Starting task 'Checkout Default Repository' of type 'com.atlassian.bamboo.plugins.vcs:task.vcs.checkout'
06-Mar-2019 15:04:34 Checking out into /opt/bamboo-home/xml-data/build-dir/INTEXT-VOLDEMORT-JOB1
06-Mar-2019 15:04:34 Updating source code to revision: 86a589ccdbc4311abaecff6ac453b085158e3e54
06-Mar-2019 15:04:34 Creating local git repository in '/opt/bamboo-home/xml-data/build-dir/INTEXT-VOLDEMORT-JOB1/.git'.
06-Mar-2019 15:04:34 Initialized empty Git repository in /opt/bamboo-home/xml-data/build-dir/INTEXT-VOLDEMORT-JOB1/.git/
06-Mar-2019 15:04:35 Fetching 'refs/heads/master' from 'https://github.com/SpringSource/spring-integration-extensions.git'.
06-Mar-2019 15:04:50 From https://github.com/SpringSource/spring-integration-extensions
06-Mar-2019 15:04:50 * [new branch]      master     -> master
06-Mar-2019 15:04:50 * [new tag]         cass.v0.5.0.RELEASE -> cass.v0.5.0.RELEASE
06-Mar-2019 15:04:50 * [new tag]         cass.v0.6.0.RELEASE -> cass.v0.6.0.RELEASE
06-Mar-2019 15:04:50 * [new tag]         hz.v1.0.0-M1 -> hz.v1.0.0-M1
06-Mar-2019 15:04:50 * [new tag]         hz.v1.0.0.M2 -> hz.v1.0.0.M2
06-Mar-2019 15:04:50 * [new tag]         hz.v1.0.0.RELEASE -> hz.v1.0.0.RELEASE
06-Mar-2019 15:04:50 * [new tag]         kafka.v1.0.0.M1 -> kafka.v1.0.0.M1
06-Mar-2019 15:04:50 * [new tag]         kafka.v1.0.0.M2 -> kafka.v1.0.0.M2
06-Mar-2019 15:04:50 * [new tag]         kafka.v1.0.0a.M2 -> kafka.v1.0.0a.M2
06-Mar-2019 15:04:50 * [new tag]         mqtt.v1.0.0.M1 -> mqtt.v1.0.0.M1
06-Mar-2019 15:04:50 * [new tag]         sidsl.v1.0.0.M1 -> sidsl.v1.0.0.M1
06-Mar-2019 15:04:50 * [new tag]         sidsl.v1.0.0.M2 -> sidsl.v1.0.0.M2
06-Mar-2019 15:04:50 * [new tag]         sidsl.v1.0.0.M3 -> sidsl.v1.0.0.M3
06-Mar-2019 15:04:50 * [new tag]         sidsl.v1.0.0.RC1 -> sidsl.v1.0.0.RC1
06-Mar-2019 15:04:50 * [new tag]         sitw.v1.0.0.M1 -> sitw.v1.0.0.M1
06-Mar-2019 15:04:50 * [new tag]         sitw.v1.0.0.RELEASE -> sitw.v1.0.0.RELEASE
06-Mar-2019 15:04:50 * [new tag]         smb.v0.5.0.RELEASE -> smb.v0.5.0.RELEASE
06-Mar-2019 15:04:50 * [new tag]         smb.v1.0.0.RELEASE -> smb.v1.0.0.RELEASE
06-Mar-2019 15:04:50 * [new tag]         smpp.v1.0.0.GA -> smpp.v1.0.0.GA
06-Mar-2019 15:04:50 * [new tag]         smpp.v1.0.0.RELEASE -> smpp.v1.0.0.RELEASE
06-Mar-2019 15:04:50 * [new tag]         splunk.v1.0.0.M1-fix -> splunk.v1.0.0.M1-fix
06-Mar-2019 15:04:50 * [new tag]         zip.v1.0.0.M1 -> zip.v1.0.0.M1
06-Mar-2019 15:04:50 * [new tag]         zip.v1.0.0.RELEASE -> zip.v1.0.0.RELEASE
06-Mar-2019 15:04:50 * [new tag]         zip.v1.0.1.RELEASE -> zip.v1.0.1.RELEASE
06-Mar-2019 15:04:50 * [new tag]         zip.v1.0.2.RELEASE -> zip.v1.0.2.RELEASE
06-Mar-2019 15:04:50 Checking out revision 86a589ccdbc4311abaecff6ac453b085158e3e54.
06-Mar-2019 15:04:50 Already on 'master'
06-Mar-2019 15:04:50 Updated source code to revision: 86a589ccdbc4311abaecff6ac453b085158e3e54
06-Mar-2019 15:04:50 Finished task 'Checkout Default Repository' with result: Success
06-Mar-2019 15:04:50 Running pre-build action: Artifactory Release Staging
06-Mar-2019 15:04:50 Running pre-build action: VCS Version Collector
06-Mar-2019 15:04:50 Starting task 'Artifactory Gradle' of type 'org.jfrog.bamboo.bamboo-artifactory-plugin:artifactoryGradleTask'
06-Mar-2019 15:04:50 Bamboo Artifactory Plugin version: 2.5.x-SNAPSHOT
06-Mar-2019 15:04:50
Beginning to execute external process for build 'Spring Integration Extensions - Spring Integration Voldemort - Default Job #4 (INTEXT-VOLDEMORT-JOB1-4)'
... running command line:
./gradlew clean build dist -I /tmp/artifactory.init.script3572466028976866646gradle -DbuildInfoConfig.propertiesFile=/tmp/buildinfo5836559520009113414properties artifactoryPublish -Dartifactory.resolve.password=******** -Dartifactory.publish.password=********
... in: /opt/bamboo-home/xml-data/build-dir/INTEXT-VOLDEMORT-JOB1/spring-integration-voldemort
... using extra environment variables:
bamboo_planRepository_1_branch=master
IRBRC=/home/bamboo/.rvm/rubies/ruby-2.3.0/.irbrc
bamboo_********_username_password=********
bamboo_signing_store_password=********
bamboo_capability_system_builder_ant_Ant_1_9=/opt/ant-1.9
bamboo_capability_system_builder_ant_Ant_1_8=/opt/ant-1.8
bamboo_planRepository_1_branchDisplayName=master
bamboo_capability_system_jdk_OpenJDK_7u181=/opt/openjdk-7
bamboo_repository_revision_number=86a589ccdbc4311abaecff6ac453b085158e3e54
bamboo_repository_119210082_previous_revision_number=c211d517769ebf72354864d7a1483ad5b20e2f1d
bamboo_capability_system_builder_node_Node_js_6=/usr/bin/node
bamboo_RIAK_BIN=/usr/sbin/riak
WRAPPER_BITS=32
bamboo_buildKey=INTEXT-VOLDEMORT-JOB1
rvm_loaded_flag=1
bamboo_bintray_password=********
bamboo_sonar_token_password=********
rvm_version=1.27.0 (latest)
PWD=/opt/bamboo-home/bin
bamboo_shortJobName=Default Job
bamboo_capability_system_builder_gradle___gradlew=./gradlew
bamboo_buildResultsUrl=https://build.spring.io/browse/INTEXT-VOLDEMORT-JOB1-4
bamboo_capability_system_builder_mvn3_Maven_3_3=/opt/maven-3.3
bamboo_capability_system_builder_mvn3_Maven_3_2=/opt/maven-3.2
bamboo_capability_system_builder_mvn3_Maven_3_1=/opt/maven-3.1
bamboo_planRepository_repositoryUrl=https://github.com/SpringSource/spring-integration-extensions.git
bamboo_agentId=208568321
bamboo_capability_system_builder_mvn3_Maven_3_5=/opt/maven-3.5
MY_RUBY_HOME=/home/bamboo/.rvm/rubies/ruby-2.3.0
bamboo_capability_system_builder_mvn3_Maven_3_0=/opt/maven-3.0
bamboo_repository_119210082_name=Spring Integration Extensions
rvm_path=/home/bamboo/.rvm
bamboo_planRepository_revision=86a589ccdbc4311abaecff6ac453b085158e3e54
bamboo_planRepository_previousRevision=c211d517769ebf72354864d7a1483ad5b20e2f1d
bamboo_capability_remote_build=true
bamboo_repository_branch_name=master
bamboo_sonatype_token_password=********
SHLVL=1
bamboo_org_jfrog_bamboo_buildInfo_serverUrl=https://repo.spring.io
bamboo_scdf_acceptance_tests_password=********
bamboo_repository_119210082_git_branch=master
WRAPPER_OS=linux
JAVA_HOME=/opt/jdk-7/
EC2_HOME=/opt/ec2-api-tools
XDG_SESSION_ID=c1
bamboo_capability_Agent=bamboo-00.af.pivotal.io
bamboo_planRepository_branch=master
bamboo_org_jfrog_bamboo_release_activated=false
bamboo_planRepository_1_type=gitv2
bamboo_planRepository_branchName=master
WRAPPER_FILE_SEPARATOR=/
_=/opt/bamboo-home/bin/bamboo-agent.sh
WRAPPER_PATH_SEPARATOR=:
bamboo_sonar_password=********
bamboo_hg_cache_directory=/opt/bamboo-home/xml-data/build-dir/_hg-repositories-cache
bamboo_planRepository_1_username=ghillert
bamboo_planRepository_type=gitv2
bamboo_repository_119210082_git_username=ghillert
bamboo_git_cache_directory=/opt/bamboo-home/xml-data/build-dir/_git-repositories-cache
bamboo_artifactory_username=buildmaster
rvm_stored_umask=0002
bamboo_tmp_directory=/opt/bamboo-home/temp
GEM_PATH=/home/bamboo/.rvm/gems/ruby-2.3.0:/home/bamboo/.rvm/gems/ruby-2.3.0@global
bamboo_planKey=INTEXT-VOLDEMORT
bamboo_planRepository_username=ghillert
bamboo_JDK8_HOME=/opt/jdk-8
NLSPATH=/usr/dt/lib/nls/msg/%L/%N.cat
bamboo_repository_119210082_revision_number=86a589ccdbc4311abaecff6ac453b085158e3e54
bamboo_planRepository_1_branchName=master
bamboo_sonar_version=5.6.3
bamboo_repository_119210082_branch_name=master
XDG_DATA_DIRS=/usr/local/share:/usr/share:/var/lib/snapd/desktop
bamboo_capability_system_jdk_JDK_1_11=/opt/jdk-11
bamboo_resultsUrl=https://build.spring.io/browse/INTEXT-VOLDEMORT-JOB1-4
bamboo_capability_system_jdk_JDK_1_10=/opt/jdk-10
bamboo_build_working_directory=/opt/bamboo-home/xml-data/build-dir/INTEXT-VOLDEMORT-JOB1
bamboo_planRepository_1_name=Spring Integration Extensions
bamboo_capability_system_os=ubuntu1604
bamboo_nexusPush_stagingProfile=buildmaster
bamboo_shortPlanName=Spring Integration Voldemort
MAIL=/var/mail/bamboo
bamboo_planRepository_name=Spring Integration Extensions
LOGNAME=bamboo
bamboo_buildNumber=4
rvm_user_install_flag=1
SHELL=/bin/bash
bamboo_planName=Spring Integration Extensions - Spring Integration Voldemort
bamboo_JDK7_HOME=/opt/jdk-7
bamboo_shortPlanKey=VOLDEMORT
OLDPWD=/opt/users/bamboo
GEM_HOME=/home/bamboo/.rvm/gems/ruby-2.3.0
bamboo_shortJobKey=JOB1
bamboo_artifactory_password=********
bamboo_buildTimeStamp=2019-03-06T15:04:34.328Z
bamboo_repository_previous_revision_number=c211d517769ebf72354864d7a1483ad5b20e2f1d
RUBY_VERSION=ruby-2.3.0
bamboo_sonar_username=buildmaster
_system_name=Ubuntu
bamboo_********_password=********
bamboo_repository_git_branch=master
bamboo_buildResultKey=INTEXT-VOLDEMORT-JOB1-4
bamboo_nexusPush_close=true
bamboo_buildPlanName=Spring Integration Extensions - Spring Integration Voldemort - Default Job
bamboo_planRepository_1_revision=86a589ccdbc4311abaecff6ac453b085158e3e54
_system_arch=x86_64
bamboo_repository_name=Spring Integration Extensions
rvm_bin_path=/home/bamboo/.rvm/bin
bamboo_signing_key_password=********
XFILESEARCHPATH=/usr/dt/app-defaults/%L/Dt
rvm_prefix=/home/bamboo
LANG=en_US.UTF-8
bamboo_buildFailed=false
bamboo_capability_system_docker_executable=/usr/bin/docker
DISPLAY=localhost:1.0
bamboo_capability_system_builder_groovy_Groovy_2_4=/opt/groovy-2.4
bamboo_artifactory_password_mask_b=********
bamboo_capability_system_builder_command_Bash=/bin/bash
bamboo_artifactory_password_mask_a=********
bamboo_agentWorkingDirectory=/opt/bamboo-home/xml-data/build-dir
bamboo_capability_system_git_executable=/usr/bin/git
bamboo_repository_git_username=ghillert
bamboo_planRepository_1_previousRevision=c211d517769ebf72354864d7a1483ad5b20e2f1d
bamboo_repository_119210082_git_repositoryUrl=https://github.com/SpringSource/spring-integration-extensions.git
bamboo_capability_os_family=unix
NVM_NODEJS_ORG_MIRROR=http://nodejs.org/dist
bamboo_planRepository_branchDisplayName=master
NODE_PATH=/usr/lib/nodejs:/usr/lib/node_modules:/usr/share/javascript
bamboo_capability_system_builder_maven_Artifactory_Maven_3_5=/opt/maven-3.5
GIT_SSL_NO_VERIFY=true
bamboo_capability_system_builder_maven_Artifactory_Maven_3_3=/opt/maven-3.3
NVM_DIR=/home/bamboo/.nvm
bamboo_capability_system_builder_maven_Artifactory_Maven_3_2=/opt/maven-3.2
bamboo_s3_properties=/home/bamboo/tools/s3.properties
bamboo_capability_system_builder_maven_Artifactory_Maven_3_1=/opt/maven-3.1
bamboo_capability_system_builder_maven_Artifactory_Maven_3_0=/opt/maven-3.0
_system_type=Linux
bamboo_plan_storageTag=INTEXT-VOLDEMORT
bamboo_bintray_username_password=********
_system_version=16.04
USER=bamboo
bamboo_repository_git_repositoryUrl=https://github.com/SpringSource/spring-integration-extensions.git
bamboo_working_directory=/opt/bamboo-home/xml-data/build-dir/INTEXT-VOLDEMORT-JOB1
bamboo_org_jfrog_bamboo_buildInfo_activated=true
bamboo_planRepository_1_repositoryUrl=https://github.com/SpringSource/spring-integration-extensions.git
bamboo_capability_system_jdk_JDK_1_8=/opt/jdk-8
bamboo_capability_system_jdk_JDK_1_9=/opt/jdk-9
WRAPPER_ARCH=x86
bamboo_capability_system_jdk_JDK_1_6=/opt/jdk-6
bamboo_sonatype_password=********
bamboo_capability_system_jdk_JDK_1_7=/opt/jdk-7
bamboo_sonar_ip=10.194.6.9
XDG_RUNTIME_DIR=/run/user/505
HOME=/home/bamboo
PATH=/bin:/home/bamboo/.rvm/gems/ruby-2.3.0/bin:/home/bamboo/.rvm/gems/ruby-2.3.0@global/bin:/home/bamboo/.rvm/rubies/ruby-2.3.0/bin:/home/bamboo/bin:/usr/local/bin:/usr/bin:/bin:/usr/local/games:/usr/games:/snap/bin:/home/bamboo/bin:/usr/local/bin:/opt/ec2-api-tools/bin:/home/bamboo/.rvm/bin:/bin:/home/bamboo/.rvm/gems/ruby-2.3.0/bin:/home/bamboo/.rvm/gems/ruby-2.3.0@global/bin:/home/bamboo/.rvm/rubies/ruby-2.3.0/bin:/home/bamboo/bin:/usr/local/bin:/usr/bin:/bin:/usr/local/games:/usr/games:/snap/bin:/home/bamboo/bin:/usr/local/bin:/opt/ec2-api-tools/bin:/home/bamboo/.rvm/bin
06-Mar-2019 15:04:50 Downloading http://services.gradle.org/distributions/gradle-1.6-bin.zip
06-Mar-2019 15:04:51 ...................................................................................................................................................................................................................................................................................................................................................................................................................................................................................................................................................................................................................................................................................................................................................................................................................................................................................................................................................................................................................................................................................................................................................................................................................................................................................................................................................................................................................................................................................................................................................................................................................................................................................................................................................................................................................................................................................................................................................................................................
06-Mar-2019 15:04:51 Unzipping /home/bamboo/.gradle/wrapper/dists/gradle-1.6-bin/72srdo3a5eb3bic159kar72vok/gradle-1.6-bin.zip to /home/bamboo/.gradle/wrapper/dists/gradle-1.6-bin/72srdo3a5eb3bic159kar72vok
06-Mar-2019 15:04:52 Set executable permissions for: /home/bamboo/.gradle/wrapper/dists/gradle-1.6-bin/72srdo3a5eb3bic159kar72vok/gradle-1.6/bin/gradle
06-Mar-2019 15:04:56 Failed to notify ProjectEvaluationListener.afterEvaluate(), but primary configuration failure takes precedence.
06-Mar-2019 15:04:56 org.gradle.listener.ListenerNotificationException: Failed to notify project evaluation listener.
06-Mar-2019 15:04:56         at org.gradle.listener.BroadcastDispatch.dispatch(BroadcastDispatch.java:90)
06-Mar-2019 15:04:56         at org.gradle.listener.BroadcastDispatch.dispatch(BroadcastDispatch.java:30)
06-Mar-2019 15:04:56         at org.gradle.messaging.dispatch.ProxyDispatchAdapter$DispatchingInvocationHandler.invoke(ProxyDispatchAdapter.java:93)
06-Mar-2019 15:04:56         at com.sun.proxy.$Proxy10.afterEvaluate(Unknown Source)
06-Mar-2019 15:04:56         at org.gradle.configuration.LifecycleProjectEvaluator.notifyAfterEvaluate(LifecycleProjectEvaluator.java:67)
06-Mar-2019 15:04:56         at org.gradle.configuration.LifecycleProjectEvaluator.evaluate(LifecycleProjectEvaluator.java:61)
06-Mar-2019 15:04:56         at org.gradle.api.internal.project.AbstractProject.evaluate(AbstractProject.java:465)
06-Mar-2019 15:04:56         at org.gradle.api.internal.project.AbstractProject.evaluate(AbstractProject.java:76)
06-Mar-2019 15:04:56         at org.gradle.configuration.DefaultBuildConfigurer.configure(DefaultBuildConfigurer.java:31)
06-Mar-2019 15:04:56         at org.gradle.initialization.DefaultGradleLauncher.doBuildStages(DefaultGradleLauncher.java:142)
06-Mar-2019 15:04:56         at org.gradle.initialization.DefaultGradleLauncher.doBuild(DefaultGradleLauncher.java:113)
06-Mar-2019 15:04:56         at org.gradle.initialization.DefaultGradleLauncher.run(DefaultGradleLauncher.java:81)
06-Mar-2019 15:04:56         at org.gradle.launcher.exec.InProcessBuildActionExecuter$DefaultBuildController.run(InProcessBuildActionExecuter.java:64)
06-Mar-2019 15:04:56         at org.gradle.launcher.cli.ExecuteBuildAction.run(ExecuteBuildAction.java:33)
06-Mar-2019 15:04:56         at org.gradle.launcher.cli.ExecuteBuildAction.run(ExecuteBuildAction.java:24)
06-Mar-2019 15:04:56         at org.gradle.launcher.exec.InProcessBuildActionExecuter.execute(InProcessBuildActionExecuter.java:35)
06-Mar-2019 15:04:56         at org.gradle.launcher.exec.InProcessBuildActionExecuter.execute(InProcessBuildActionExecuter.java:26)
06-Mar-2019 15:04:56         at org.gradle.launcher.cli.RunBuildAction.run(RunBuildAction.java:50)
06-Mar-2019 15:04:56         at org.gradle.api.internal.Actions$RunnableActionAdapter.execute(Actions.java:171)
06-Mar-2019 15:04:56         at org.gradle.launcher.cli.CommandLineActionFactory$ParseAndBuildAction.execute(CommandLineActionFactory.java:201)
06-Mar-2019 15:04:56         at org.gradle.launcher.cli.CommandLineActionFactory$ParseAndBuildAction.execute(CommandLineActionFactory.java:174)
06-Mar-2019 15:04:56         at org.gradle.launcher.cli.CommandLineActionFactory$WithLogging.execute(CommandLineActionFactory.java:170)
06-Mar-2019 15:04:56         at org.gradle.launcher.cli.CommandLineActionFactory$WithLogging.execute(CommandLineActionFactory.java:139)
06-Mar-2019 15:04:56         at org.gradle.launcher.cli.ExceptionReportingAction.execute(ExceptionReportingAction.java:33)
06-Mar-2019 15:04:56         at org.gradle.launcher.cli.ExceptionReportingAction.execute(ExceptionReportingAction.java:22)
06-Mar-2019 15:04:56         at org.gradle.launcher.Main.doAction(Main.java:48)
06-Mar-2019 15:04:56         at org.gradle.launcher.bootstrap.EntryPoint.run(EntryPoint.java:45)
06-Mar-2019 15:04:56         at org.gradle.launcher.Main.main(Main.java:39)
06-Mar-2019 15:04:56         at sun.reflect.NativeMethodAccessorImpl.invoke0(Native Method)
06-Mar-2019 15:04:56         at sun.reflect.NativeMethodAccessorImpl.invoke(NativeMethodAccessorImpl.java:57)
06-Mar-2019 15:04:56         at sun.reflect.DelegatingMethodAccessorImpl.invoke(DelegatingMethodAccessorImpl.java:43)
06-Mar-2019 15:04:56         at java.lang.reflect.Method.invoke(Method.java:606)
06-Mar-2019 15:04:56         at org.gradle.launcher.bootstrap.ProcessBootstrap.runNoExit(ProcessBootstrap.java:50)
06-Mar-2019 15:04:56         at org.gradle.launcher.bootstrap.ProcessBootstrap.run(ProcessBootstrap.java:32)
06-Mar-2019 15:04:56         at org.gradle.launcher.GradleMain.main(GradleMain.java:26)
06-Mar-2019 15:04:56         at sun.reflect.NativeMethodAccessorImpl.invoke0(Native Method)
06-Mar-2019 15:04:56         at sun.reflect.NativeMethodAccessorImpl.invoke(NativeMethodAccessorImpl.java:57)
06-Mar-2019 15:04:56         at sun.reflect.DelegatingMethodAccessorImpl.invoke(DelegatingMethodAccessorImpl.java:43)
06-Mar-2019 15:04:56         at java.lang.reflect.Method.invoke(Method.java:606)
06-Mar-2019 15:04:56         at org.gradle.wrapper.BootstrapMainStarter.start(BootstrapMainStarter.java:33)
06-Mar-2019 15:04:56         at org.gradle.wrapper.WrapperExecutor.execute(WrapperExecutor.java:130)
06-Mar-2019 15:04:56         at org.gradle.wrapper.GradleWrapperMain.main(GradleWrapperMain.java:48)
06-Mar-2019 15:04:56 Caused by: org.gradle.listener.ListenerNotificationException: Failed to notify project evaluation listener.
06-Mar-2019 15:04:56         at org.gradle.listener.BroadcastDispatch.dispatch(BroadcastDispatch.java:90)
06-Mar-2019 15:04:56         at org.gradle.listener.BroadcastDispatch.dispatch(BroadcastDispatch.java:30)
06-Mar-2019 15:04:56         at org.gradle.messaging.dispatch.ProxyDispatchAdapter$DispatchingInvocationHandler.invoke(ProxyDispatchAdapter.java:93)
06-Mar-2019 15:04:56         at com.sun.proxy.$Proxy10.afterEvaluate(Unknown Source)
06-Mar-2019 15:04:56         at sun.reflect.NativeMethodAccessorImpl.invoke0(Native Method)
06-Mar-2019 15:04:56         at sun.reflect.NativeMethodAccessorImpl.invoke(NativeMethodAccessorImpl.java:57)
06-Mar-2019 15:04:56         at sun.reflect.DelegatingMethodAccessorImpl.invoke(DelegatingMethodAccessorImpl.java:43)
06-Mar-2019 15:04:56         at java.lang.reflect.Method.invoke(Method.java:606)
06-Mar-2019 15:04:56         at org.gradle.messaging.dispatch.ReflectionDispatch.dispatch(ReflectionDispatch.java:35)
06-Mar-2019 15:04:56         at org.gradle.messaging.dispatch.ReflectionDispatch.dispatch(ReflectionDispatch.java:24)
06-Mar-2019 15:04:56         at org.gradle.listener.BroadcastDispatch.dispatch(BroadcastDispatch.java:81)
06-Mar-2019 15:04:56         ... 41 more
06-Mar-2019 15:04:56 Caused by: org.gradle.listener.ListenerNotificationException: Failed to notify project evaluation listener.
06-Mar-2019 15:04:56         at org.gradle.listener.BroadcastDispatch.dispatch(BroadcastDispatch.java:90)
06-Mar-2019 15:04:56         at org.gradle.listener.BroadcastDispatch.dispatch(BroadcastDispatch.java:30)
06-Mar-2019 15:04:56         at org.gradle.messaging.dispatch.ProxyDispatchAdapter$DispatchingInvocationHandler.invoke(ProxyDispatchAdapter.java:93)
06-Mar-2019 15:04:56         at com.sun.proxy.$Proxy10.afterEvaluate(Unknown Source)
06-Mar-2019 15:04:56         at sun.reflect.NativeMethodAccessorImpl.invoke0(Native Method)
06-Mar-2019 15:04:56         at sun.reflect.NativeMethodAccessorImpl.invoke(NativeMethodAccessorImpl.java:57)
06-Mar-2019 15:04:56         at sun.reflect.DelegatingMethodAccessorImpl.invoke(DelegatingMethodAccessorImpl.java:43)
06-Mar-2019 15:04:56         at java.lang.reflect.Method.invoke(Method.java:606)
06-Mar-2019 15:04:56         at org.gradle.messaging.dispatch.ReflectionDispatch.dispatch(ReflectionDispatch.java:35)
06-Mar-2019 15:04:56         at org.gradle.messaging.dispatch.ReflectionDispatch.dispatch(ReflectionDispatch.java:24)
06-Mar-2019 15:04:56         at org.gradle.listener.BroadcastDispatch.dispatch(BroadcastDispatch.java:81)
06-Mar-2019 15:04:56         ... 51 more
06-Mar-2019 15:04:56 Caused by: org.gradle.listener.ListenerNotificationException: Failed to notify project evaluation listener.
06-Mar-2019 15:04:56         at org.gradle.listener.BroadcastDispatch.dispatch(BroadcastDispatch.java:90)
06-Mar-2019 15:04:56         at org.gradle.listener.BroadcastDispatch.dispatch(BroadcastDispatch.java:30)
06-Mar-2019 15:04:56         at org.gradle.listener.BroadcastDispatch.dispatch(BroadcastDispatch.java:81)
06-Mar-2019 15:04:56         ... 61 more
06-Mar-2019 15:04:56 Caused by: java.lang.NoSuchMethodError: org.jfrog.gradle.plugin.artifactory.task.ArtifactoryTask.finalizedBy([Ljava/lang/Object;)Lorg/gradle/api/Task;
06-Mar-2019 15:04:56         at org.jfrog.gradle.plugin.artifactory.task.ArtifactoryTask.finalizeByDeployTask(ArtifactoryTask.java:235)
06-Mar-2019 15:04:56         at org.jfrog.gradle.plugin.artifactory.task.ArtifactoryTask$finalizeByDeployTask.call(Unknown Source)
06-Mar-2019 15:04:56         at org.codehaus.groovy.runtime.callsite.CallSiteArray.defaultCall(CallSiteArray.java:42)
06-Mar-2019 15:04:56         at org.codehaus.groovy.runtime.callsite.AbstractCallSite.call(AbstractCallSite.java:108)
06-Mar-2019 15:04:56         at org.codehaus.groovy.runtime.callsite.AbstractCallSite.call(AbstractCallSite.java:116)
06-Mar-2019 15:04:56         at org.jfrog.gradle.plugin.artifactory.extractor.listener.ProjectsEvaluatedBuildListener$_afterEvaluate_closure1.doCall(ProjectsEvaluatedBuildListener.groovy:50)
06-Mar-2019 15:04:56         at sun.reflect.NativeMethodAccessorImpl.invoke0(Native Method)
06-Mar-2019 15:04:56         at sun.reflect.NativeMethodAccessorImpl.invoke(NativeMethodAccessorImpl.java:57)
06-Mar-2019 15:04:56         at sun.reflect.DelegatingMethodAccessorImpl.invoke(DelegatingMethodAccessorImpl.java:43)
06-Mar-2019 15:04:56         at java.lang.reflect.Method.invoke(Method.java:606)
06-Mar-2019 15:04:56         at org.codehaus.groovy.reflection.CachedMethod.invoke(CachedMethod.java:90)
06-Mar-2019 15:04:56         at groovy.lang.MetaMethod.doMethodInvoke(MetaMethod.java:233)
06-Mar-2019 15:04:56         at org.codehaus.groovy.runtime.metaclass.ClosureMetaClass.invokeMethod(ClosureMetaClass.java:272)
06-Mar-2019 15:04:56         at groovy.lang.MetaClassImpl.invokeMethod(MetaClassImpl.java:877)
06-Mar-2019 15:04:56         at groovy.lang.Closure.call(Closure.java:412)
06-Mar-2019 15:04:56         at groovy.lang.Closure.call(Closure.java:425)
06-Mar-2019 15:04:56         at org.codehaus.groovy.runtime.DefaultGroovyMethods.each(DefaultGroovyMethods.java:1376)
06-Mar-2019 15:04:56         at org.codehaus.groovy.runtime.DefaultGroovyMethods.each(DefaultGroovyMethods.java:1348)
06-Mar-2019 15:04:56         at org.codehaus.groovy.runtime.dgm$162.invoke(Unknown Source)
06-Mar-2019 15:04:56         at org.codehaus.groovy.runtime.callsite.PojoMetaMethodSite$PojoMetaMethodSiteNoUnwrapNoCoerce.invoke(PojoMetaMethodSite.java:271)
06-Mar-2019 15:04:56         at org.codehaus.groovy.runtime.callsite.PojoMetaMethodSite.call(PojoMetaMethodSite.java:53)
06-Mar-2019 15:04:56         at org.codehaus.groovy.runtime.callsite.CallSiteArray.defaultCall(CallSiteArray.java:42)
06-Mar-2019 15:04:56         at org.codehaus.groovy.runtime.callsite.AbstractCallSite.call(AbstractCallSite.java:108)
06-Mar-2019 15:04:56         at org.codehaus.groovy.runtime.callsite.AbstractCallSite.call(AbstractCallSite.java:116)
06-Mar-2019 15:04:56         at org.jfrog.gradle.plugin.artifactory.extractor.listener.ProjectsEvaluatedBuildListener.afterEvaluate(ProjectsEvaluatedBuildListener.groovy:48)
06-Mar-2019 15:04:56         at sun.reflect.NativeMethodAccessorImpl.invoke0(Native Method)
06-Mar-2019 15:04:56         at sun.reflect.NativeMethodAccessorImpl.invoke(NativeMethodAccessorImpl.java:57)
06-Mar-2019 15:04:56         at sun.reflect.DelegatingMethodAccessorImpl.invoke(DelegatingMethodAccessorImpl.java:43)
06-Mar-2019 15:04:56         at java.lang.reflect.Method.invoke(Method.java:606)
06-Mar-2019 15:04:56         at org.gradle.messaging.dispatch.ReflectionDispatch.dispatch(ReflectionDispatch.java:35)
06-Mar-2019 15:04:56         at org.gradle.messaging.dispatch.ReflectionDispatch.dispatch(ReflectionDispatch.java:24)
06-Mar-2019 15:04:56         at org.gradle.listener.BroadcastDispatch.dispatch(BroadcastDispatch.java:81)
06-Mar-2019 15:04:56         ... 63 more
06-Mar-2019 15:04:56
06-Mar-2019 15:04:56 FAILURE: Build failed with an exception.
06-Mar-2019 15:04:56
06-Mar-2019 15:04:56 * What went wrong:
06-Mar-2019 15:04:56 A problem occurred configuring root project 'spring-integration-voldemort'.
06-Mar-2019 15:04:56 > Could not resolve all dependencies for configuration ':classpath'.
06-Mar-2019 15:04:56    > Could not resolve org.springframework.build.gradle:docbook-reference-plugin:0.1.5.
06-Mar-2019 15:04:56      Required by:
06-Mar-2019 15:04:56          :spring-integration-voldemort:1.0.0.BUILD-SNAPSHOT
06-Mar-2019 15:04:56       > Could not GET 'https://repo.springsource.org/plugins-snapshot/org/springframework/build/gradle/docbook-reference-plugin/0.1.5/docbook-reference-plugin-0.1.5.pom'.
06-Mar-2019 15:04:56          > peer not authenticated
06-Mar-2019 15:04:56
06-Mar-2019 15:04:56 * Try:
06-Mar-2019 15:04:56 Run with --stacktrace option to get the stack trace. Run with --info or --debug option to get more log output.
06-Mar-2019 15:04:56
06-Mar-2019 15:04:56 BUILD FAILED
06-Mar-2019 15:04:56
06-Mar-2019 15:04:56 Total time: 5.739 secs
06-Mar-2019 15:04:56
06-Mar-2019 15:04:56 Failing task since return code of [./gradlew clean build dist -I /tmp/artifactory.init.script3572466028976866646gradle -DbuildInfoConfig.propertiesFile=/tmp/buildinfo5836559520009113414properties artifactoryPublish -Dartifactory.resolve.password=******** -Dartifactory.publish.password=********] was 1 while expected 0
06-Mar-2019 15:04:56 Parsing test results under /opt/bamboo-home/xml-data/build-dir/INTEXT-VOLDEMORT-JOB1...
06-Mar-2019 15:04:56 Finished task 'Artifactory Gradle' with result: Failed
06-Mar-2019 15:04:56 Running post build plugin 'Docker Container Cleanup'
06-Mar-2019 15:04:56 Running post build plugin 'NCover Results Collector'
06-Mar-2019 15:04:56 Running post build plugin 'Artifactory Release Management Staging'
06-Mar-2019 15:04:56 Running post build plugin 'Artifactory Build Info Copier'
06-Mar-2019 15:04:56 Running post build plugin 'Artifactory Gradle Properties Info Copier'
06-Mar-2019 15:04:56 Running post build plugin 'Clover Results Collector'
06-Mar-2019 15:04:56 Running post build plugin 'npm Cache Cleanup'
06-Mar-2019 15:04:56 Running post build plugin 'Artifact Copier'
06-Mar-2019 15:04:56 Finalising the build...
06-Mar-2019 15:04:56 Stopping timer.
06-Mar-2019 15:04:56 Build INTEXT-VOLDEMORT-JOB1-4 completed.
06-Mar-2019 15:04:56 Running on server: post build plugin 'NCover Results Collector'
06-Mar-2019 15:04:56 Running on server: post build plugin 'Build Hanging Detection Configuration'
06-Mar-2019 15:04:56 Running on server: post build plugin 'Clover Delta Calculator'
06-Mar-2019 15:04:56 Running on server: post build plugin 'Maven Dependencies Postprocessor'
06-Mar-2019 15:04:56 All post build plugins have finished
06-Mar-2019 15:04:56 Generating build results summary...
06-Mar-2019 15:04:56 Saving build results to disk...
06-Mar-2019 15:04:56 Logging substituted variables...
06-Mar-2019 15:04:56 Indexing build results...
06-Mar-2019 15:04:56 Finished building INTEXT-VOLDEMORT-JOB1-4.