Build: #8 failed

Job: Default Job failed

Stages & jobs

  1. Default Stage

Build log

The build generated 197 lines of output. Download or view full build log

28-Mar-2019 11:28:40 Build Spring Integration Extensions - Spring Integration Voldemort - Default Job #8 (INTEXT-VOLDEMORT-JOB1-8) started building on agent bamboo-03.af.pivotal.io
28-Mar-2019 11:28:40 Remote agent on host bamboo-03.af.pivotal.io
28-Mar-2019 11:28:40 Build working directory is /opt/bamboo-home/xml-data/build-dir/INTEXT-VOLDEMORT-JOB1
28-Mar-2019 11:28:40 Executing build Spring Integration Extensions - Spring Integration Voldemort - Default Job #8 (INTEXT-VOLDEMORT-JOB1-8)
28-Mar-2019 11:28:40 Starting task 'Checkout Default Repository' of type 'com.atlassian.bamboo.plugins.vcs:task.vcs.checkout'
28-Mar-2019 11:28:40 Checking out into /opt/bamboo-home/xml-data/build-dir/INTEXT-VOLDEMORT-JOB1
28-Mar-2019 11:28:40 Updating source code to revision: 2b0f44ebbbc846542a379042840a84164dcf9465
28-Mar-2019 11:28:40 Creating local git repository in '/opt/bamboo-home/xml-data/build-dir/INTEXT-VOLDEMORT-JOB1/.git'.
28-Mar-2019 11:28:40 Initialized empty Git repository in /opt/bamboo-home/xml-data/build-dir/INTEXT-VOLDEMORT-JOB1/.git/
28-Mar-2019 11:28:41 Fetching 'refs/heads/master' from 'https://github.com/SpringSource/spring-integration-extensions.git'.
28-Mar-2019 11:28:42 From https://github.com/SpringSource/spring-integration-extensions
28-Mar-2019 11:28:42 * [new branch]      master     -> master
28-Mar-2019 11:28:42 * [new tag]         cass.v0.5.0.RELEASE -> cass.v0.5.0.RELEASE
28-Mar-2019 11:28:42 * [new tag]         cass.v0.6.0.RELEASE -> cass.v0.6.0.RELEASE
28-Mar-2019 11:28:42 * [new tag]         hz.v1.0.0-M1 -> hz.v1.0.0-M1
28-Mar-2019 11:28:42 * [new tag]         hz.v1.0.0.M2 -> hz.v1.0.0.M2
28-Mar-2019 11:28:42 * [new tag]         hz.v1.0.0.RELEASE -> hz.v1.0.0.RELEASE
28-Mar-2019 11:28:42 * [new tag]         kafka.v1.0.0.M1 -> kafka.v1.0.0.M1
28-Mar-2019 11:28:42 * [new tag]         kafka.v1.0.0.M2 -> kafka.v1.0.0.M2
28-Mar-2019 11:28:42 * [new tag]         kafka.v1.0.0a.M2 -> kafka.v1.0.0a.M2
28-Mar-2019 11:28:42 * [new tag]         mqtt.v1.0.0.M1 -> mqtt.v1.0.0.M1
28-Mar-2019 11:28:42 * [new tag]         sidsl.v1.0.0.M1 -> sidsl.v1.0.0.M1
28-Mar-2019 11:28:42 * [new tag]         sidsl.v1.0.0.M2 -> sidsl.v1.0.0.M2
28-Mar-2019 11:28:42 * [new tag]         sidsl.v1.0.0.M3 -> sidsl.v1.0.0.M3
28-Mar-2019 11:28:42 * [new tag]         sidsl.v1.0.0.RC1 -> sidsl.v1.0.0.RC1
28-Mar-2019 11:28:42 * [new tag]         sitw.v1.0.0.M1 -> sitw.v1.0.0.M1
28-Mar-2019 11:28:42 * [new tag]         sitw.v1.0.0.RELEASE -> sitw.v1.0.0.RELEASE
28-Mar-2019 11:28:42 * [new tag]         smb.v0.5.0.RELEASE -> smb.v0.5.0.RELEASE
28-Mar-2019 11:28:42 * [new tag]         smb.v1.0.0.RELEASE -> smb.v1.0.0.RELEASE
28-Mar-2019 11:28:42 * [new tag]         smpp.v1.0.0.GA -> smpp.v1.0.0.GA
28-Mar-2019 11:28:42 * [new tag]         smpp.v1.0.0.RELEASE -> smpp.v1.0.0.RELEASE
28-Mar-2019 11:28:42 * [new tag]         splunk.v1.0.0.M1-fix -> splunk.v1.0.0.M1-fix
28-Mar-2019 11:28:42 * [new tag]         zip.v1.0.0.M1 -> zip.v1.0.0.M1
28-Mar-2019 11:28:42 * [new tag]         zip.v1.0.0.RELEASE -> zip.v1.0.0.RELEASE
28-Mar-2019 11:28:42 * [new tag]         zip.v1.0.1.RELEASE -> zip.v1.0.1.RELEASE
28-Mar-2019 11:28:42 * [new tag]         zip.v1.0.2.RELEASE -> zip.v1.0.2.RELEASE
28-Mar-2019 11:28:42 Checking out revision 2b0f44ebbbc846542a379042840a84164dcf9465.
28-Mar-2019 11:28:42 Already on 'master'
28-Mar-2019 11:28:42 Updated source code to revision: 2b0f44ebbbc846542a379042840a84164dcf9465
28-Mar-2019 11:28:42 Finished task 'Checkout Default Repository' with result: Success
28-Mar-2019 11:28:42 Running pre-build action: Artifactory Release Staging
28-Mar-2019 11:28:42 Running pre-build action: VCS Version Collector
28-Mar-2019 11:28:42 Starting task 'Artifactory Gradle' of type 'org.jfrog.bamboo.bamboo-artifactory-plugin:artifactoryGradleTask'
28-Mar-2019 11:28:42 Bamboo Artifactory Plugin version: 2.5.x-SNAPSHOT
28-Mar-2019 11:28:43
Beginning to execute external process for build 'Spring Integration Extensions - Spring Integration Voldemort - Default Job #8 (INTEXT-VOLDEMORT-JOB1-8)'
... running command line:
./gradlew clean build dist -I /tmp/artifactory.init.script6106961191766719162gradle -DbuildInfoConfig.propertiesFile=/tmp/buildinfo3933149885733964303properties artifactoryPublish -Dartifactory.resolve.password=******** -Dartifactory.publish.password=********
... in: /opt/bamboo-home/xml-data/build-dir/INTEXT-VOLDEMORT-JOB1/spring-integration-voldemort
... using extra environment variables:
bamboo_planRepository_1_branch=master
bamboo_********_username_password=********
bamboo_signing_store_password=********
bamboo_capability_system_builder_ant_Ant_1_9=/opt/ant-1.9
bamboo_capability_system_builder_ant_Ant_1_8=/opt/ant-1.8
bamboo_planRepository_1_branchDisplayName=master
bamboo_capability_system_jdk_OpenJDK_7u181=/opt/openjdk-7
bamboo_repository_revision_number=2b0f44ebbbc846542a379042840a84164dcf9465
bamboo_repository_119210082_previous_revision_number=c26352daeaff514274d880d8bf57c3fb373cb467
bamboo_capability_system_builder_node_Node_js_6=/usr/bin/node
bamboo_RIAK_BIN=/usr/sbin/riak
WRAPPER_BITS=32
bamboo_buildKey=INTEXT-VOLDEMORT-JOB1
bamboo_bintray_password=********
bamboo_sonar_token_password=********
PWD=/opt/bamboo-home/bin
bamboo_shortJobName=Default Job
bamboo_capability_system_builder_gradle___gradlew=./gradlew
bamboo_buildResultsUrl=https://build.spring.io/browse/INTEXT-VOLDEMORT-JOB1-8
bamboo_capability_system_builder_mvn3_Maven_3_3=/opt/maven-3.3
bamboo_capability_system_builder_mvn3_Maven_3_2=/opt/maven-3.2
bamboo_capability_system_builder_mvn3_Maven_3_1=/opt/maven-3.1
bamboo_planRepository_repositoryUrl=https://github.com/SpringSource/spring-integration-extensions.git
bamboo_agentId=208568326
bamboo_capability_system_builder_mvn3_Maven_3_5=/opt/maven-3.5
bamboo_capability_system_builder_mvn3_Maven_3_0=/opt/maven-3.0
bamboo_repository_119210082_name=Spring Integration Extensions
bamboo_planRepository_revision=2b0f44ebbbc846542a379042840a84164dcf9465
bamboo_planRepository_previousRevision=c26352daeaff514274d880d8bf57c3fb373cb467
bamboo_capability_remote_build=true
bamboo_repository_branch_name=master
bamboo_sonatype_token_password=********
SHLVL=1
bamboo_org_jfrog_bamboo_buildInfo_serverUrl=https://repo.spring.io
bamboo_scdf_acceptance_tests_password=********
bamboo_repository_119210082_git_branch=master
WRAPPER_OS=linux
JAVA_HOME=/opt/jdk-7/
XDG_SESSION_ID=20579
bamboo_capability_Agent=bamboo-03.af.pivotal.io
bamboo_planRepository_branch=master
bamboo_org_jfrog_bamboo_release_activated=false
bamboo_planRepository_1_type=gitv2
bamboo_planRepository_branchName=master
bamboo_capability_system_jdk_JDK_12=/opt/jdk-12
WRAPPER_FILE_SEPARATOR=/
_=./bamboo-agent.sh
SSH_CLIENT=10.255.200.169 54102 22
WRAPPER_PATH_SEPARATOR=:
bamboo_sonar_password=********
bamboo_hg_cache_directory=/opt/bamboo-home/xml-data/build-dir/_hg-repositories-cache
bamboo_planRepository_1_username=ghillert
bamboo_planRepository_type=gitv2
bamboo_repository_119210082_git_username=ghillert
bamboo_git_cache_directory=/opt/bamboo-home/xml-data/build-dir/_git-repositories-cache
bamboo_artifactory_username=buildmaster
bamboo_tmp_directory=/opt/bamboo-home/temp
SSH_CONNECTION=10.255.200.169 54102 10.194.6.13 22
bamboo_planKey=INTEXT-VOLDEMORT
bamboo_planRepository_username=ghillert
bamboo_JDK8_HOME=/opt/jdk-8
NLSPATH=/usr/dt/lib/nls/msg/%L/%N.cat
bamboo_repository_119210082_revision_number=2b0f44ebbbc846542a379042840a84164dcf9465
bamboo_planRepository_1_branchName=master
bamboo_sonar_version=5.6.3
bamboo_repository_119210082_branch_name=master
bamboo_capability_system_jdk_JDK_1_11=/opt/jdk-11
bamboo_resultsUrl=https://build.spring.io/browse/INTEXT-VOLDEMORT-JOB1-8
bamboo_capability_system_jdk_JDK_1_10=/opt/jdk-10
bamboo_build_working_directory=/opt/bamboo-home/xml-data/build-dir/INTEXT-VOLDEMORT-JOB1
bamboo_planRepository_1_name=Spring Integration Extensions
bamboo_capability_system_os=ubuntu1604
bamboo_nexusPush_stagingProfile=buildmaster
bamboo_shortPlanName=Spring Integration Voldemort
MAIL=/var/mail/bamboo
bamboo_planRepository_name=Spring Integration Extensions
LOGNAME=bamboo
bamboo_buildNumber=8
SHELL=/bin/bash
bamboo_planName=Spring Integration Extensions - Spring Integration Voldemort
bamboo_JDK7_HOME=/opt/jdk-7
bamboo_shortPlanKey=VOLDEMORT
OLDPWD=/opt/bamboo-home/bin
bamboo_shortJobKey=JOB1
bamboo_artifactory_password=********
bamboo_buildTimeStamp=2019-03-28T11:28:40.596Z
bamboo_repository_previous_revision_number=c26352daeaff514274d880d8bf57c3fb373cb467
bamboo_sonar_username=buildmaster
bamboo_********_password=********
bamboo_repository_git_branch=master
bamboo_buildResultKey=INTEXT-VOLDEMORT-JOB1-8
bamboo_nexusPush_close=true
bamboo_buildPlanName=Spring Integration Extensions - Spring Integration Voldemort - Default Job
bamboo_planRepository_1_revision=2b0f44ebbbc846542a379042840a84164dcf9465
bamboo_repository_name=Spring Integration Extensions
bamboo_signing_key_password=********
XFILESEARCHPATH=/usr/dt/app-defaults/%L/Dt
LANG=en_US.UTF-8
bamboo_buildFailed=false
bamboo_capability_system_docker_executable=/usr/bin/docker
bamboo_capability_system_builder_groovy_Groovy_2_4=/opt/groovy-2.4
bamboo_artifactory_password_mask_b=********
bamboo_capability_system_builder_command_Bash=/bin/bash
bamboo_artifactory_password_mask_a=********
bamboo_agentWorkingDirectory=/opt/bamboo-home/xml-data/build-dir
bamboo_capability_system_git_executable=/usr/bin/git
bamboo_repository_git_username=ghillert
bamboo_planRepository_1_previousRevision=c26352daeaff514274d880d8bf57c3fb373cb467
bamboo_repository_119210082_git_repositoryUrl=https://github.com/SpringSource/spring-integration-extensions.git
bamboo_capability_os_family=unix
bamboo_planRepository_branchDisplayName=master
bamboo_capability_system_builder_maven_Artifactory_Maven_3_5=/opt/maven-3.5
bamboo_capability_system_builder_maven_Artifactory_Maven_3_3=/opt/maven-3.3
bamboo_capability_system_builder_maven_Artifactory_Maven_3_2=/opt/maven-3.2
bamboo_s3_properties=/home/bamboo/tools/s3.properties
bamboo_capability_system_builder_maven_Artifactory_Maven_3_1=/opt/maven-3.1
bamboo_capability_system_builder_maven_Artifactory_Maven_3_0=/opt/maven-3.0
bamboo_plan_storageTag=INTEXT-VOLDEMORT
bamboo_bintray_username_password=********
USER=bamboo
bamboo_repository_git_repositoryUrl=https://github.com/SpringSource/spring-integration-extensions.git
SSH_AUTH_SOCK=/tmp/ssh-lobuxN0e4B/agent.5791
bamboo_working_directory=/opt/bamboo-home/xml-data/build-dir/INTEXT-VOLDEMORT-JOB1
bamboo_org_jfrog_bamboo_buildInfo_activated=true
bamboo_planRepository_1_repositoryUrl=https://github.com/SpringSource/spring-integration-extensions.git
bamboo_capability_system_jdk_JDK_1_8=/opt/jdk-8
bamboo_capability_system_jdk_JDK_1_9=/opt/jdk-9
WRAPPER_ARCH=x86
bamboo_capability_system_jdk_JDK_1_6=/opt/jdk-6
bamboo_sonatype_password=********
bamboo_capability_system_jdk_JDK_1_7=/opt/jdk-7
bamboo_sonar_ip=10.194.6.9
XDG_RUNTIME_DIR=/run/user/505
HOME=/home/bamboo
PATH=/bin:/usr/local/sbin:/usr/local/bin:/usr/sbin:/usr/bin:/sbin:/bin:/usr/games:/usr/local/games:/bin:/usr/local/sbin:/usr/local/bin:/usr/sbin:/usr/bin:/sbin:/bin:/usr/games:/usr/local/games
28-Mar-2019 11:28:47 Failed to notify ProjectEvaluationListener.afterEvaluate(), but primary configuration failure takes precedence.
28-Mar-2019 11:28:47 org.gradle.listener.ListenerNotificationException: Failed to notify project evaluation listener.
28-Mar-2019 11:28:47         at org.gradle.listener.BroadcastDispatch.dispatch(BroadcastDispatch.java:90)
28-Mar-2019 11:28:47         at org.gradle.listener.BroadcastDispatch.dispatch(BroadcastDispatch.java:30)
28-Mar-2019 11:28:47         at org.gradle.messaging.dispatch.ProxyDispatchAdapter$DispatchingInvocationHandler.invoke(ProxyDispatchAdapter.java:93)
28-Mar-2019 11:28:47         at com.sun.proxy.$Proxy10.afterEvaluate(Unknown Source)
28-Mar-2019 11:28:47         at org.gradle.configuration.LifecycleProjectEvaluator.notifyAfterEvaluate(LifecycleProjectEvaluator.java:67)
28-Mar-2019 11:28:47         at org.gradle.configuration.LifecycleProjectEvaluator.evaluate(LifecycleProjectEvaluator.java:61)
28-Mar-2019 11:28:47         at org.gradle.api.internal.project.AbstractProject.evaluate(AbstractProject.java:465)
28-Mar-2019 11:28:47         at org.gradle.api.internal.project.AbstractProject.evaluate(AbstractProject.java:76)
28-Mar-2019 11:28:47         at org.gradle.configuration.DefaultBuildConfigurer.configure(DefaultBuildConfigurer.java:31)
28-Mar-2019 11:28:47         at org.gradle.initialization.DefaultGradleLauncher.doBuildStages(DefaultGradleLauncher.java:142)
28-Mar-2019 11:28:47         at org.gradle.initialization.DefaultGradleLauncher.doBuild(DefaultGradleLauncher.java:113)
28-Mar-2019 11:28:47         at org.gradle.initialization.DefaultGradleLauncher.run(DefaultGradleLauncher.java:81)
28-Mar-2019 11:28:47         at org.gradle.launcher.exec.InProcessBuildActionExecuter$DefaultBuildController.run(InProcessBuildActionExecuter.java:64)
28-Mar-2019 11:28:47         at org.gradle.launcher.cli.ExecuteBuildAction.run(ExecuteBuildAction.java:33)
28-Mar-2019 11:28:47         at org.gradle.launcher.cli.ExecuteBuildAction.run(ExecuteBuildAction.java:24)
28-Mar-2019 11:28:47         at org.gradle.launcher.exec.InProcessBuildActionExecuter.execute(InProcessBuildActionExecuter.java:35)
28-Mar-2019 11:28:47         at org.gradle.launcher.exec.InProcessBuildActionExecuter.execute(InProcessBuildActionExecuter.java:26)
28-Mar-2019 11:28:47         at org.gradle.launcher.cli.RunBuildAction.run(RunBuildAction.java:50)
28-Mar-2019 11:28:47         at org.gradle.api.internal.Actions$RunnableActionAdapter.execute(Actions.java:171)
28-Mar-2019 11:28:47         at org.gradle.launcher.cli.CommandLineActionFactory$ParseAndBuildAction.execute(CommandLineActionFactory.java:201)
28-Mar-2019 11:28:47         at org.gradle.launcher.cli.CommandLineActionFactory$ParseAndBuildAction.execute(CommandLineActionFactory.java:174)
28-Mar-2019 11:28:47         at org.gradle.launcher.cli.CommandLineActionFactory$WithLogging.execute(CommandLineActionFactory.java:170)
28-Mar-2019 11:28:47         at org.gradle.launcher.cli.CommandLineActionFactory$WithLogging.execute(CommandLineActionFactory.java:139)
28-Mar-2019 11:28:47         at org.gradle.launcher.cli.ExceptionReportingAction.execute(ExceptionReportingAction.java:33)
28-Mar-2019 11:28:47         at org.gradle.launcher.cli.ExceptionReportingAction.execute(ExceptionReportingAction.java:22)
28-Mar-2019 11:28:47         at org.gradle.launcher.Main.doAction(Main.java:48)
28-Mar-2019 11:28:47         at org.gradle.launcher.bootstrap.EntryPoint.run(EntryPoint.java:45)
28-Mar-2019 11:28:47         at org.gradle.launcher.Main.main(Main.java:39)
28-Mar-2019 11:28:47         at sun.reflect.NativeMethodAccessorImpl.invoke0(Native Method)
28-Mar-2019 11:28:47         at sun.reflect.NativeMethodAccessorImpl.invoke(NativeMethodAccessorImpl.java:57)
28-Mar-2019 11:28:47         at sun.reflect.DelegatingMethodAccessorImpl.invoke(DelegatingMethodAccessorImpl.java:43)
28-Mar-2019 11:28:47         at java.lang.reflect.Method.invoke(Method.java:606)
28-Mar-2019 11:28:47         at org.gradle.launcher.bootstrap.ProcessBootstrap.runNoExit(ProcessBootstrap.java:50)
28-Mar-2019 11:28:47         at org.gradle.launcher.bootstrap.ProcessBootstrap.run(ProcessBootstrap.java:32)
28-Mar-2019 11:28:47         at org.gradle.launcher.GradleMain.main(GradleMain.java:26)
28-Mar-2019 11:28:47         at sun.reflect.NativeMethodAccessorImpl.invoke0(Native Method)
28-Mar-2019 11:28:47         at sun.reflect.NativeMethodAccessorImpl.invoke(NativeMethodAccessorImpl.java:57)
28-Mar-2019 11:28:47         at sun.reflect.DelegatingMethodAccessorImpl.invoke(DelegatingMethodAccessorImpl.java:43)
28-Mar-2019 11:28:47         at java.lang.reflect.Method.invoke(Method.java:606)
28-Mar-2019 11:28:47         at org.gradle.wrapper.BootstrapMainStarter.start(BootstrapMainStarter.java:33)
28-Mar-2019 11:28:47         at org.gradle.wrapper.WrapperExecutor.execute(WrapperExecutor.java:130)
28-Mar-2019 11:28:47         at org.gradle.wrapper.GradleWrapperMain.main(GradleWrapperMain.java:48)
28-Mar-2019 11:28:47 Caused by: org.gradle.listener.ListenerNotificationException: Failed to notify project evaluation listener.
28-Mar-2019 11:28:47         at org.gradle.listener.BroadcastDispatch.dispatch(BroadcastDispatch.java:90)
28-Mar-2019 11:28:47         at org.gradle.listener.BroadcastDispatch.dispatch(BroadcastDispatch.java:30)
28-Mar-2019 11:28:47         at org.gradle.messaging.dispatch.ProxyDispatchAdapter$DispatchingInvocationHandler.invoke(ProxyDispatchAdapter.java:93)
28-Mar-2019 11:28:47         at com.sun.proxy.$Proxy10.afterEvaluate(Unknown Source)
28-Mar-2019 11:28:47         at sun.reflect.NativeMethodAccessorImpl.invoke0(Native Method)
28-Mar-2019 11:28:47         at sun.reflect.NativeMethodAccessorImpl.invoke(NativeMethodAccessorImpl.java:57)
28-Mar-2019 11:28:47         at sun.reflect.DelegatingMethodAccessorImpl.invoke(DelegatingMethodAccessorImpl.java:43)
28-Mar-2019 11:28:47         at java.lang.reflect.Method.invoke(Method.java:606)
28-Mar-2019 11:28:47         at org.gradle.messaging.dispatch.ReflectionDispatch.dispatch(ReflectionDispatch.java:35)
28-Mar-2019 11:28:47         at org.gradle.messaging.dispatch.ReflectionDispatch.dispatch(ReflectionDispatch.java:24)
28-Mar-2019 11:28:47         at org.gradle.listener.BroadcastDispatch.dispatch(BroadcastDispatch.java:81)
28-Mar-2019 11:28:47         ... 41 more
28-Mar-2019 11:28:47 Caused by: org.gradle.listener.ListenerNotificationException: Failed to notify project evaluation listener.
28-Mar-2019 11:28:47         at org.gradle.listener.BroadcastDispatch.dispatch(BroadcastDispatch.java:90)
28-Mar-2019 11:28:47         at org.gradle.listener.BroadcastDispatch.dispatch(BroadcastDispatch.java:30)
28-Mar-2019 11:28:47         at org.gradle.messaging.dispatch.ProxyDispatchAdapter$DispatchingInvocationHandler.invoke(ProxyDispatchAdapter.java:93)
28-Mar-2019 11:28:47         at com.sun.proxy.$Proxy10.afterEvaluate(Unknown Source)
28-Mar-2019 11:28:47         at sun.reflect.NativeMethodAccessorImpl.invoke0(Native Method)
28-Mar-2019 11:28:47         at sun.reflect.NativeMethodAccessorImpl.invoke(NativeMethodAccessorImpl.java:57)
28-Mar-2019 11:28:47         at sun.reflect.DelegatingMethodAccessorImpl.invoke(DelegatingMethodAccessorImpl.java:43)
28-Mar-2019 11:28:47         at java.lang.reflect.Method.invoke(Method.java:606)
28-Mar-2019 11:28:47         at org.gradle.messaging.dispatch.ReflectionDispatch.dispatch(ReflectionDispatch.java:35)
28-Mar-2019 11:28:47         at org.gradle.messaging.dispatch.ReflectionDispatch.dispatch(ReflectionDispatch.java:24)
28-Mar-2019 11:28:47         at org.gradle.listener.BroadcastDispatch.dispatch(BroadcastDispatch.java:81)
28-Mar-2019 11:28:47         ... 51 more
28-Mar-2019 11:28:47 Caused by: org.gradle.listener.ListenerNotificationException: Failed to notify project evaluation listener.
28-Mar-2019 11:28:47         at org.gradle.listener.BroadcastDispatch.dispatch(BroadcastDispatch.java:90)
28-Mar-2019 11:28:47         at org.gradle.listener.BroadcastDispatch.dispatch(BroadcastDispatch.java:30)
28-Mar-2019 11:28:47         at org.gradle.listener.BroadcastDispatch.dispatch(BroadcastDispatch.java:81)
28-Mar-2019 11:28:47         ... 61 more
28-Mar-2019 11:28:47 Caused by: java.lang.NoSuchMethodError: org.jfrog.gradle.plugin.artifactory.task.ArtifactoryTask.finalizedBy([Ljava/lang/Object;)Lorg/gradle/api/Task;
28-Mar-2019 11:28:47         at org.jfrog.gradle.plugin.artifactory.task.ArtifactoryTask.finalizeByDeployTask(ArtifactoryTask.java:235)
28-Mar-2019 11:28:47         at org.jfrog.gradle.plugin.artifactory.task.ArtifactoryTask$finalizeByDeployTask.call(Unknown Source)
28-Mar-2019 11:28:47         at org.codehaus.groovy.runtime.callsite.CallSiteArray.defaultCall(CallSiteArray.java:42)
28-Mar-2019 11:28:47         at org.codehaus.groovy.runtime.callsite.AbstractCallSite.call(AbstractCallSite.java:108)
28-Mar-2019 11:28:47         at org.codehaus.groovy.runtime.callsite.AbstractCallSite.call(AbstractCallSite.java:116)
28-Mar-2019 11:28:47         at org.jfrog.gradle.plugin.artifactory.extractor.listener.ProjectsEvaluatedBuildListener$_afterEvaluate_closure1.doCall(ProjectsEvaluatedBuildListener.groovy:50)
28-Mar-2019 11:28:47         at sun.reflect.NativeMethodAccessorImpl.invoke0(Native Method)
28-Mar-2019 11:28:47         at sun.reflect.NativeMethodAccessorImpl.invoke(NativeMethodAccessorImpl.java:57)
28-Mar-2019 11:28:47         at sun.reflect.DelegatingMethodAccessorImpl.invoke(DelegatingMethodAccessorImpl.java:43)
28-Mar-2019 11:28:47         at java.lang.reflect.Method.invoke(Method.java:606)
28-Mar-2019 11:28:47         at org.codehaus.groovy.reflection.CachedMethod.invoke(CachedMethod.java:90)
28-Mar-2019 11:28:47         at groovy.lang.MetaMethod.doMethodInvoke(MetaMethod.java:233)
28-Mar-2019 11:28:47         at org.codehaus.groovy.runtime.metaclass.ClosureMetaClass.invokeMethod(ClosureMetaClass.java:272)
28-Mar-2019 11:28:47         at groovy.lang.MetaClassImpl.invokeMethod(MetaClassImpl.java:877)
28-Mar-2019 11:28:47         at groovy.lang.Closure.call(Closure.java:412)
28-Mar-2019 11:28:47         at groovy.lang.Closure.call(Closure.java:425)
28-Mar-2019 11:28:47         at org.codehaus.groovy.runtime.DefaultGroovyMethods.each(DefaultGroovyMethods.java:1376)
28-Mar-2019 11:28:47         at org.codehaus.groovy.runtime.DefaultGroovyMethods.each(DefaultGroovyMethods.java:1348)
28-Mar-2019 11:28:47         at org.codehaus.groovy.runtime.dgm$162.invoke(Unknown Source)
28-Mar-2019 11:28:47         at org.codehaus.groovy.runtime.callsite.PojoMetaMethodSite$PojoMetaMethodSiteNoUnwrapNoCoerce.invoke(PojoMetaMethodSite.java:271)
28-Mar-2019 11:28:47         at org.codehaus.groovy.runtime.callsite.PojoMetaMethodSite.call(PojoMetaMethodSite.java:53)
28-Mar-2019 11:28:47         at org.codehaus.groovy.runtime.callsite.CallSiteArray.defaultCall(CallSiteArray.java:42)
28-Mar-2019 11:28:47         at org.codehaus.groovy.runtime.callsite.AbstractCallSite.call(AbstractCallSite.java:108)
28-Mar-2019 11:28:47         at org.codehaus.groovy.runtime.callsite.AbstractCallSite.call(AbstractCallSite.java:116)
28-Mar-2019 11:28:47         at org.jfrog.gradle.plugin.artifactory.extractor.listener.ProjectsEvaluatedBuildListener.afterEvaluate(ProjectsEvaluatedBuildListener.groovy:48)
28-Mar-2019 11:28:47         at sun.reflect.NativeMethodAccessorImpl.invoke0(Native Method)
28-Mar-2019 11:28:47         at sun.reflect.NativeMethodAccessorImpl.invoke(NativeMethodAccessorImpl.java:57)
28-Mar-2019 11:28:47         at sun.reflect.DelegatingMethodAccessorImpl.invoke(DelegatingMethodAccessorImpl.java:43)
28-Mar-2019 11:28:47         at java.lang.reflect.Method.invoke(Method.java:606)
28-Mar-2019 11:28:47         at org.gradle.messaging.dispatch.ReflectionDispatch.dispatch(ReflectionDispatch.java:35)
28-Mar-2019 11:28:47         at org.gradle.messaging.dispatch.ReflectionDispatch.dispatch(ReflectionDispatch.java:24)
28-Mar-2019 11:28:47         at org.gradle.listener.BroadcastDispatch.dispatch(BroadcastDispatch.java:81)
28-Mar-2019 11:28:47         ... 63 more
28-Mar-2019 11:28:47
28-Mar-2019 11:28:47 FAILURE: Build failed with an exception.
28-Mar-2019 11:28:47
28-Mar-2019 11:28:47 * What went wrong:
28-Mar-2019 11:28:47 A problem occurred configuring root project 'spring-integration-voldemort'.
28-Mar-2019 11:28:47 > Could not resolve all dependencies for configuration ':classpath'.
28-Mar-2019 11:28:47    > Could not resolve org.springframework.build.gradle:docbook-reference-plugin:0.1.5.
28-Mar-2019 11:28:47      Required by:
28-Mar-2019 11:28:47          :spring-integration-voldemort:1.0.0.BUILD-SNAPSHOT
28-Mar-2019 11:28:47       > Could not GET 'https://repo.springsource.org/plugins-snapshot/org/springframework/build/gradle/docbook-reference-plugin/0.1.5/docbook-reference-plugin-0.1.5.pom'.
28-Mar-2019 11:28:47          > peer not authenticated
28-Mar-2019 11:28:47
28-Mar-2019 11:28:47 * Try:
28-Mar-2019 11:28:47 Run with --stacktrace option to get the stack trace. Run with --info or --debug option to get more log output.
28-Mar-2019 11:28:47
28-Mar-2019 11:28:47 BUILD FAILED
28-Mar-2019 11:28:47
28-Mar-2019 11:28:47 Total time: 4.511 secs
28-Mar-2019 11:28:47
28-Mar-2019 11:28:47 Failing task since return code of [./gradlew clean build dist -I /tmp/artifactory.init.script6106961191766719162gradle -DbuildInfoConfig.propertiesFile=/tmp/buildinfo3933149885733964303properties artifactoryPublish -Dartifactory.resolve.password=******** -Dartifactory.publish.password=********] was 1 while expected 0
28-Mar-2019 11:28:47 Parsing test results under /opt/bamboo-home/xml-data/build-dir/INTEXT-VOLDEMORT-JOB1...
28-Mar-2019 11:28:47 Finished task 'Artifactory Gradle' with result: Failed
28-Mar-2019 11:28:47 Running post build plugin 'Docker Container Cleanup'
28-Mar-2019 11:28:47 Running post build plugin 'NCover Results Collector'
28-Mar-2019 11:28:47 Running post build plugin 'Artifactory Release Management Staging'
28-Mar-2019 11:28:47 Running post build plugin 'Artifactory Build Info Copier'
28-Mar-2019 11:28:47 Running post build plugin 'Artifactory Gradle Properties Info Copier'
28-Mar-2019 11:28:47 Running post build plugin 'Clover Results Collector'
28-Mar-2019 11:28:47 Running post build plugin 'npm Cache Cleanup'
28-Mar-2019 11:28:47 Running post build plugin 'Artifact Copier'
28-Mar-2019 11:28:47 Finalising the build...
28-Mar-2019 11:28:47 Stopping timer.
28-Mar-2019 11:28:47 Build INTEXT-VOLDEMORT-JOB1-8 completed.
28-Mar-2019 11:28:47 Running on server: post build plugin 'NCover Results Collector'
28-Mar-2019 11:28:47 Running on server: post build plugin 'Build Hanging Detection Configuration'
28-Mar-2019 11:28:47 Running on server: post build plugin 'Clover Delta Calculator'
28-Mar-2019 11:28:47 Running on server: post build plugin 'Maven Dependencies Postprocessor'
28-Mar-2019 11:28:47 All post build plugins have finished
28-Mar-2019 11:28:47 Generating build results summary...
28-Mar-2019 11:28:47 Saving build results to disk...
28-Mar-2019 11:28:47 Logging substituted variables...
28-Mar-2019 11:28:47 Indexing build results...
28-Mar-2019 11:28:47 Finished building INTEXT-VOLDEMORT-JOB1-8.