Build: #1301 failed

Job: Default Job failed

Stages & jobs

  1. Default Stage

Build log

The build generated 170 lines of output. Download or view full build log

14-Jan-2019 01:10:01 Build Spring Integration Extensions - Spring Integration Zip - Sonar - Default Job #1301 (INTEXT-ZIPSONAR-JOB1-1301) started building on agent bamboo-12.af.pivotal.io
14-Jan-2019 01:10:01 Remote agent on host bamboo-12.af.pivotal.io
14-Jan-2019 01:10:01 Build working directory is /opt/bamboo-home/xml-data/build-dir/INTEXT-ZIPSONAR-JOB1
14-Jan-2019 01:10:01 Executing build Spring Integration Extensions - Spring Integration Zip - Sonar - Default Job #1301 (INTEXT-ZIPSONAR-JOB1-1301)
14-Jan-2019 01:10:01 Starting task 'Checkout Default Repository' of type 'com.atlassian.bamboo.plugins.vcs:task.vcs.checkout'
14-Jan-2019 01:10:01 Checking out into /opt/bamboo-home/xml-data/build-dir/INTEXT-ZIPSONAR-JOB1
14-Jan-2019 01:10:01 Updating source code to revision: 6a9af8fc8ab47cba19cbce3da95849e2eed250b3
14-Jan-2019 01:10:01 Creating local git repository in '/opt/bamboo-home/xml-data/build-dir/INTEXT-ZIPSONAR-JOB1/.git'.
14-Jan-2019 01:10:01 Initialized empty Git repository in /opt/bamboo-home/xml-data/build-dir/INTEXT-ZIPSONAR-JOB1/.git/
14-Jan-2019 01:10:02 Fetching 'refs/heads/master' from 'https://github.com/SpringSource/spring-integration-extensions.git'.
14-Jan-2019 01:10:05 From https://github.com/SpringSource/spring-integration-extensions
14-Jan-2019 01:10:05 * [new branch]      master     -> master
14-Jan-2019 01:10:05 * [new tag]         cass.v0.5.0.RELEASE -> cass.v0.5.0.RELEASE
14-Jan-2019 01:10:05 * [new tag]         hz.v1.0.0-M1 -> hz.v1.0.0-M1
14-Jan-2019 01:10:05 * [new tag]         hz.v1.0.0.M2 -> hz.v1.0.0.M2
14-Jan-2019 01:10:05 * [new tag]         hz.v1.0.0.RELEASE -> hz.v1.0.0.RELEASE
14-Jan-2019 01:10:05 * [new tag]         kafka.v1.0.0.M1 -> kafka.v1.0.0.M1
14-Jan-2019 01:10:05 * [new tag]         kafka.v1.0.0.M2 -> kafka.v1.0.0.M2
14-Jan-2019 01:10:05 * [new tag]         kafka.v1.0.0a.M2 -> kafka.v1.0.0a.M2
14-Jan-2019 01:10:05 * [new tag]         mqtt.v1.0.0.M1 -> mqtt.v1.0.0.M1
14-Jan-2019 01:10:05 * [new tag]         sidsl.v1.0.0.M1 -> sidsl.v1.0.0.M1
14-Jan-2019 01:10:05 * [new tag]         sidsl.v1.0.0.M2 -> sidsl.v1.0.0.M2
14-Jan-2019 01:10:05 * [new tag]         sidsl.v1.0.0.M3 -> sidsl.v1.0.0.M3
14-Jan-2019 01:10:05 * [new tag]         sidsl.v1.0.0.RC1 -> sidsl.v1.0.0.RC1
14-Jan-2019 01:10:05 * [new tag]         sitw.v1.0.0.M1 -> sitw.v1.0.0.M1
14-Jan-2019 01:10:05 * [new tag]         sitw.v1.0.0.RELEASE -> sitw.v1.0.0.RELEASE
14-Jan-2019 01:10:05 * [new tag]         smb.v0.5.0.RELEASE -> smb.v0.5.0.RELEASE
14-Jan-2019 01:10:05 * [new tag]         smb.v1.0.0.RELEASE -> smb.v1.0.0.RELEASE
14-Jan-2019 01:10:05 * [new tag]         smpp.v1.0.0.GA -> smpp.v1.0.0.GA
14-Jan-2019 01:10:05 * [new tag]         smpp.v1.0.0.RELEASE -> smpp.v1.0.0.RELEASE
14-Jan-2019 01:10:05 * [new tag]         splunk.v1.0.0.M1-fix -> splunk.v1.0.0.M1-fix
14-Jan-2019 01:10:05 * [new tag]         zip.v1.0.0.M1 -> zip.v1.0.0.M1
14-Jan-2019 01:10:05 * [new tag]         zip.v1.0.0.RELEASE -> zip.v1.0.0.RELEASE
14-Jan-2019 01:10:05 * [new tag]         zip.v1.0.1.RELEASE -> zip.v1.0.1.RELEASE
14-Jan-2019 01:10:05 * [new tag]         zip.v1.0.2.RELEASE -> zip.v1.0.2.RELEASE
14-Jan-2019 01:10:05 Checking out revision 6a9af8fc8ab47cba19cbce3da95849e2eed250b3.
14-Jan-2019 01:10:05 Already on 'master'
14-Jan-2019 01:10:05 Updated source code to revision: 6a9af8fc8ab47cba19cbce3da95849e2eed250b3
14-Jan-2019 01:10:05 Finished task 'Checkout Default Repository' with result: Success
14-Jan-2019 01:10:05 Running pre-build action: Artifactory Release Staging
14-Jan-2019 01:10:05 Running pre-build action: VCS Version Collector
14-Jan-2019 01:10:05
Substituting password variable: ${bamboo.sonar.password}
14-Jan-2019 01:10:05 Starting task 'Execute Gradle Wrapper' of type 'com.atlassian.bamboo.plugins.scripttask:task.builder.script'
14-Jan-2019 01:10:05
Beginning to execute external process for build 'Spring Integration Extensions - Spring Integration Zip - Sonar - Default Job #1301 (INTEXT-ZIPSONAR-JOB1-1301)'
... running command line:
/bin/sh ./gradlew clean build sonarRunner --continue --stacktrace -Dsonar.jdbc.driverClassName=org.postgresql.Driver -Dsonar.jdbc.url=jdbc:postgresql://10.194.6.9/sonar -Dsonar.host.url=https://sonar.spring.io -Dsonar.jdbc.username=sonar -Dsonar.jdbc.password=********
... in: /opt/bamboo-home/xml-data/build-dir/INTEXT-ZIPSONAR-JOB1/spring-integration-zip
... using extra environment variables:
bamboo_planRepository_1_branch=master
bamboo_********_username_password=********
bamboo_signing_store_password=********
bamboo_planRepository_2_branch=INTEXT-40
bamboo_capability_system_builder_ant_Ant_1_9=/opt/ant-1.9
bamboo_capability_system_builder_ant_Ant_1_8=/opt/ant-1.8
bamboo_planRepository_1_branchDisplayName=master
bamboo_capability_system_jdk_OpenJDK_7u181=/opt/openjdk-7
bamboo_repository_revision_number=c07a7069293e7c83f69ba2f23735d8ae9f5c52f6
bamboo_capability_system_builder_node_Node_js_6=/usr/bin/node
bamboo_RIAK_BIN=/usr/sbin/riak
bamboo_repository_177209392_git_repositoryUrl=https://github.com/ghillert/spring-integration-extensions.git
bamboo_buildKey=INTEXT-ZIPSONAR-JOB1
bamboo_repository_177209391_git_branch=master
bamboo_sonar_token_password=********
bamboo_planRepository_2_branchDisplayName=INTEXT-40
bamboo_shortJobName=Default Job
bamboo_capability_system_builder_gradle___gradlew=./gradlew
bamboo_buildResultsUrl=https://build.spring.io/browse/INTEXT-ZIPSONAR-JOB1-1301
bamboo_capability_system_builder_mvn3_Maven_3_3=/opt/maven-3.3
bamboo_capability_system_builder_mvn3_Maven_3_2=/opt/maven-3.2
bamboo_capability_system_builder_mvn3_Maven_3_1=/opt/maven-3.1
bamboo_planRepository_repositoryUrl=https://github.com/SpringSource/spring-integration-extensions.git
bamboo_repository_177209391_git_repositoryUrl=https://github.com/SpringSource/spring-integration-extensions.git
bamboo_agentId=208568336
bamboo_capability_system_builder_mvn3_Maven_3_5=/opt/maven-3.5
bamboo_capability_system_builder_mvn3_Maven_3_0=/opt/maven-3.0
bamboo_planRepository_revision=6a9af8fc8ab47cba19cbce3da95849e2eed250b3
bamboo_planRepository_previousRevision=6a9af8fc8ab47cba19cbce3da95849e2eed250b3
bamboo_capability_remote_build=true
bamboo_repository_branch_name=INTEXT-40
bamboo_repository_177209391_name=Spring Integration Extensions
bamboo_scdf_acceptance_tests_password=********
bamboo_repository_177209392_git_branch=INTEXT-40
JAVA_HOME=/opt/jdk-8
bamboo_capability_Agent=bamboo-12.af.pivotal.io
bamboo_planRepository_branch=master
bamboo_repository_177209392_name=GHILLERT - SI Extensions
bamboo_repository_177209391_previous_revision_number=6a9af8fc8ab47cba19cbce3da95849e2eed250b3
bamboo_planRepository_1_type=gitv2
bamboo_planRepository_branchName=master
bamboo_repository_177209391_git_username=spring-buildmaster
bamboo_sonar_password=********
bamboo_hg_cache_directory=/opt/bamboo-home/xml-data/build-dir/_hg-repositories-cache
bamboo_planRepository_1_username=spring-buildmaster
bamboo_planRepository_type=gitv2
bamboo_git_cache_directory=/opt/bamboo-home/xml-data/build-dir/_git-repositories-cache
bamboo_planRepository_2_branchName=INTEXT-40
bamboo_artifactory_username=buildmaster
bamboo_tmp_directory=/opt/bamboo-home/temp
bamboo_planKey=INTEXT-ZIPSONAR
bamboo_planRepository_username=spring-buildmaster
bamboo_JDK8_HOME=/opt/jdk-8
bamboo_planRepository_1_branchName=master
bamboo_sonar_version=5.6.3
bamboo_repository_177209392_previous_revision_number=c07a7069293e7c83f69ba2f23735d8ae9f5c52f6
bamboo_capability_system_jdk_JDK_1_11=/opt/jdk-11
bamboo_resultsUrl=https://build.spring.io/browse/INTEXT-ZIPSONAR-JOB1-1301
bamboo_capability_system_jdk_JDK_1_10=/opt/jdk-10
bamboo_build_working_directory=/opt/bamboo-home/xml-data/build-dir/INTEXT-ZIPSONAR-JOB1
bamboo_planRepository_1_name=Spring Integration Extensions
bamboo_capability_system_os=ubuntu1604
bamboo_nexusPush_stagingProfile=buildmaster
bamboo_shortPlanName=Spring Integration Zip - Sonar
bamboo_planRepository_2_username=ghillert
bamboo_planRepository_name=Spring Integration Extensions
bamboo_buildNumber=1301
bamboo_planName=Spring Integration Extensions - Spring Integration Zip - Sonar
bamboo_JDK7_HOME=/opt/jdk-7
bamboo_shortPlanKey=ZIPSONAR
bamboo_shortJobKey=JOB1
bamboo_artifactory_password=********
bamboo_planRepository_2_name=GHILLERT - SI Extensions
bamboo_buildTimeStamp=2019-01-14T01:10:01.506Z
bamboo_repository_previous_revision_number=c07a7069293e7c83f69ba2f23735d8ae9f5c52f6
bamboo_sonar_username=buildmaster
bamboo_********_password=********
bamboo_repository_git_branch=INTEXT-40
bamboo_buildResultKey=INTEXT-ZIPSONAR-JOB1-1301
bamboo_nexusPush_close=true
bamboo_buildPlanName=Spring Integration Extensions - Spring Integration Zip - Sonar - Default Job
bamboo_planRepository_1_revision=6a9af8fc8ab47cba19cbce3da95849e2eed250b3
bamboo_repository_177209392_revision_number=c07a7069293e7c83f69ba2f23735d8ae9f5c52f6
bamboo_repository_name=GHILLERT - SI Extensions
bamboo_signing_key_password=********
bamboo_repository_177209391_revision_number=6a9af8fc8ab47cba19cbce3da95849e2eed250b3
bamboo_planRepository_2_previousRevision=c07a7069293e7c83f69ba2f23735d8ae9f5c52f6
bamboo_buildFailed=false
bamboo_capability_system_docker_executable=/usr/bin/docker
bamboo_capability_system_builder_groovy_Groovy_2_4=/opt/groovy-2.4
bamboo_capability_system_builder_command_Bash=/bin/bash
bamboo_agentWorkingDirectory=/opt/bamboo-home/xml-data/build-dir
bamboo_planRepository_2_revision=c07a7069293e7c83f69ba2f23735d8ae9f5c52f6
bamboo_capability_system_git_executable=/usr/bin/git
bamboo_repository_git_username=ghillert
bamboo_planRepository_1_previousRevision=6a9af8fc8ab47cba19cbce3da95849e2eed250b3
bamboo_capability_os_family=unix
bamboo_planRepository_branchDisplayName=master
bamboo_capability_system_builder_maven_Artifactory_Maven_3_5=/opt/maven-3.5
bamboo_capability_system_builder_maven_Artifactory_Maven_3_3=/opt/maven-3.3
bamboo_planRepository_2_type=gh2
bamboo_capability_system_builder_maven_Artifactory_Maven_3_2=/opt/maven-3.2
bamboo_s3_properties=/home/bamboo/tools/s3.properties
bamboo_capability_system_builder_maven_Artifactory_Maven_3_1=/opt/maven-3.1
bamboo_capability_system_builder_maven_Artifactory_Maven_3_0=/opt/maven-3.0
bamboo_plan_storageTag=INTEXT-ZIPSONAR
bamboo_repository_177209392_git_username=ghillert
bamboo_planRepository_2_repositoryUrl=https://github.com/ghillert/spring-integration-extensions.git
bamboo_repository_177209391_branch_name=master
bamboo_repository_git_repositoryUrl=https://github.com/ghillert/spring-integration-extensions.git
bamboo_repository_177209392_branch_name=INTEXT-40
bamboo_working_directory=/opt/bamboo-home/xml-data/build-dir/INTEXT-ZIPSONAR-JOB1
bamboo_planRepository_1_repositoryUrl=https://github.com/SpringSource/spring-integration-extensions.git
bamboo_capability_system_jdk_JDK_1_8=/opt/jdk-8
bamboo_capability_system_jdk_JDK_1_9=/opt/jdk-9
bamboo_capability_system_jdk_JDK_1_6=/opt/jdk-6
bamboo_capability_system_jdk_JDK_1_7=/opt/jdk-7
bamboo_sonar_ip=10.194.6.9
14-Jan-2019 01:10:06 Starting a Gradle Daemon (subsequent builds will be faster)
14-Jan-2019 01:10:09
14-Jan-2019 01:10:09 FAILURE: Build failed with an exception.
14-Jan-2019 01:10:09
14-Jan-2019 01:10:09 * What went wrong:
14-Jan-2019 01:10:09 Task 'sonarRunner' not found in root project 'spring-integration-zip'.
14-Jan-2019 01:10:09
14-Jan-2019 01:10:09 * Try:
14-Jan-2019 01:10:09 Run gradlew tasks to get a list of available tasks. Run with --info or --debug option to get more log output. Run with --scan to get full insights.
14-Jan-2019 01:10:09
14-Jan-2019 01:10:09 * Exception is:
14-Jan-2019 01:10:09 org.gradle.execution.TaskSelectionException: Task 'sonarRunner' not found in root project 'spring-integration-zip'.
14-Jan-2019 01:10:09         at org.gradle.execution.TaskSelector.getSelection(TaskSelector.java:116)
14-Jan-2019 01:10:09         at org.gradle.execution.TaskSelector.getSelection(TaskSelector.java:81)
14-Jan-2019 01:10:09         at org.gradle.execution.commandline.CommandLineTaskParser.parseTasks(CommandLineTaskParser.java:42)
14-Jan-2019 01:10:09         at org.gradle.execution.TaskNameResolvingBuildConfigurationAction.configure(TaskNameResolvingBuildConfigurationAction.java:44)
14-Jan-2019 01:10:09         at org.gradle.execution.DefaultBuildConfigurationActionExecuter.configure(DefaultBuildConfigurationActionExecuter.java:48)
14-Jan-2019 01:10:09         at org.gradle.execution.DefaultBuildConfigurationActionExecuter.access$000(DefaultBuildConfigurationActionExecuter.java:25)
14-Jan-2019 01:10:09         at org.gradle.execution.DefaultBuildConfigurationActionExecuter$1.proceed(DefaultBuildConfigurationActionExecuter.java:54)
14-Jan-2019 01:10:09         at org.gradle.execution.DefaultTasksBuildExecutionAction.configure(DefaultTasksBuildExecutionAction.java:44)
14-Jan-2019 01:10:09         at org.gradle.execution.DefaultBuildConfigurationActionExecuter.configure(DefaultBuildConfigurationActionExecuter.java:48)
14-Jan-2019 01:10:09         at org.gradle.execution.DefaultBuildConfigurationActionExecuter.access$000(DefaultBuildConfigurationActionExecuter.java:25)
14-Jan-2019 01:10:09         at org.gradle.execution.DefaultBuildConfigurationActionExecuter$1.proceed(DefaultBuildConfigurationActionExecuter.java:54)
14-Jan-2019 01:10:09         at org.gradle.execution.ExcludedTaskFilteringBuildConfigurationAction.configure(ExcludedTaskFilteringBuildConfigurationAction.java:47)
14-Jan-2019 01:10:09         at org.gradle.execution.DefaultBuildConfigurationActionExecuter.configure(DefaultBuildConfigurationActionExecuter.java:48)
14-Jan-2019 01:10:09         at org.gradle.execution.DefaultBuildConfigurationActionExecuter.select(DefaultBuildConfigurationActionExecuter.java:36)
14-Jan-2019 01:10:09         at org.gradle.initialization.DefaultGradleLauncher$CalculateTaskGraph.run(DefaultGradleLauncher.java:286)
14-Jan-2019 01:10:09         at org.gradle.internal.operations.DefaultBuildOperationExecutor$RunnableBuildOperationWorker.execute(DefaultBuildOperationExecutor.java:317)
14-Jan-2019 01:10:09         at org.gradle.internal.operations.DefaultBuildOperationExecutor$RunnableBuildOperationWorker.execute(DefaultBuildOperationExecutor.java:309)
14-Jan-2019 01:10:09         at org.gradle.internal.operations.DefaultBuildOperationExecutor.execute(DefaultBuildOperationExecutor.java:185)
14-Jan-2019 01:10:09         at org.gradle.internal.operations.DefaultBuildOperationExecutor.run(DefaultBuildOperationExecutor.java:97)
14-Jan-2019 01:10:09         at org.gradle.internal.operations.DelegatingBuildOperationExecutor.run(DelegatingBuildOperationExecutor.java:31)
14-Jan-2019 01:10:09         at org.gradle.initialization.DefaultGradleLauncher.constructTaskGraph(DefaultGradleLauncher.java:181)
14-Jan-2019 01:10:09         at org.gradle.initialization.DefaultGradleLauncher.doBuildStages(DefaultGradleLauncher.java:136)
14-Jan-2019 01:10:09         at org.gradle.initialization.DefaultGradleLauncher.executeTasks(DefaultGradleLauncher.java:115)
14-Jan-2019 01:10:09         at org.gradle.internal.invocation.GradleBuildController$1.call(GradleBuildController.java:78)
14-Jan-2019 01:10:09         at org.gradle.internal.invocation.GradleBuildController$1.call(GradleBuildController.java:75)
14-Jan-2019 01:10:09         at org.gradle.internal.work.DefaultWorkerLeaseService.withLocks(DefaultWorkerLeaseService.java:152)
14-Jan-2019 01:10:09         at org.gradle.internal.work.StopShieldingWorkerLeaseService.withLocks(StopShieldingWorkerLeaseService.java:38)
14-Jan-2019 01:10:09         at org.gradle.internal.invocation.GradleBuildController.doBuild(GradleBuildController.java:100)
14-Jan-2019 01:10:09         at org.gradle.internal.invocation.GradleBuildController.run(GradleBuildController.java:75)
14-Jan-2019 01:10:09         at org.gradle.tooling.internal.provider.ExecuteBuildActionRunner.run(ExecuteBuildActionRunner.java:28)
14-Jan-2019 01:10:09         at org.gradle.launcher.exec.ChainingBuildActionRunner.run(ChainingBuildActionRunner.java:35)
14-Jan-2019 01:10:09         at org.gradle.tooling.internal.provider.ValidatingBuildActionRunner.run(ValidatingBuildActionRunner.java:32)
14-Jan-2019 01:10:09         at org.gradle.launcher.exec.RunAsBuildOperationBuildActionRunner$3.run(RunAsBuildOperationBuildActionRunner.java:45)
14-Jan-2019 01:10:09         at org.gradle.internal.operations.DefaultBuildOperationExecutor$RunnableBuildOperationWorker.execute(DefaultBuildOperationExecutor.java:317)
14-Jan-2019 01:10:09         at org.gradle.internal.operations.DefaultBuildOperationExecutor$RunnableBuildOperationWorker.execute(DefaultBuildOperationExecutor.java:309)
14-Jan-2019 01:10:09         at org.gradle.internal.operations.DefaultBuildOperationExecutor.execute(DefaultBuildOperationExecutor.java:185)
14-Jan-2019 01:10:09         at org.gradle.internal.operations.DefaultBuildOperationExecutor.run(DefaultBuildOperationExecutor.java:97)
14-Jan-2019 01:10:09         at org.gradle.internal.operations.DelegatingBuildOperationExecutor.run(DelegatingBuildOperationExecutor.java:31)
14-Jan-2019 01:10:09         at org.gradle.launcher.exec.RunAsBuildOperationBuildActionRunner.run(RunAsBuildOperationBuildActionRunner.java:42)
14-Jan-2019 01:10:09         at org.gradle.tooling.internal.provider.SubscribableBuildActionRunner.run(SubscribableBuildActionRunner.java:51)
14-Jan-2019 01:10:09         at org.gradle.launcher.exec.InProcessBuildActionExecuter.execute(InProcessBuildActionExecuter.java:47)
14-Jan-2019 01:10:09         at org.gradle.launcher.exec.InProcessBuildActionExecuter.execute(InProcessBuildActionExecuter.java:31)
14-Jan-2019 01:10:09         at org.gradle.launcher.exec.BuildTreeScopeBuildActionExecuter.execute(BuildTreeScopeBuildActionExecuter.java:39)
14-Jan-2019 01:10:09         at org.gradle.launcher.exec.BuildTreeScopeBuildActionExecuter.execute(BuildTreeScopeBuildActionExecuter.java:25)
14-Jan-2019 01:10:09         at org.gradle.tooling.internal.provider.ContinuousBuildActionExecuter.execute(ContinuousBuildActionExecuter.java:80)
14-Jan-2019 01:10:09         at org.gradle.tooling.internal.provider.ContinuousBuildActionExecuter.execute(ContinuousBuildActionExecuter.java:53)
14-Jan-2019 01:10:09         at org.gradle.tooling.internal.provider.ServicesSetupBuildActionExecuter.execute(ServicesSetupBuildActionExecuter.java:61)
14-Jan-2019 01:10:09         at org.gradle.tooling.internal.provider.ServicesSetupBuildActionExecuter.execute(ServicesSetupBuildActionExecuter.java:34)
14-Jan-2019 01:10:09         at org.gradle.tooling.internal.provider.GradleThreadBuildActionExecuter.execute(GradleThreadBuildActionExecuter.java:36)
14-Jan-2019 01:10:09         at org.gradle.tooling.internal.provider.GradleThreadBuildActionExecuter.execute(GradleThreadBuildActionExecuter.java:25)
14-Jan-2019 01:10:09         at org.gradle.tooling.internal.provider.ParallelismConfigurationBuildActionExecuter.execute(ParallelismConfigurationBuildActionExecuter.java:43)
14-Jan-2019 01:10:09         at org.gradle.tooling.internal.provider.ParallelismConfigurationBuildActionExecuter.execute(ParallelismConfigurationBuildActionExecuter.java:29)
14-Jan-2019 01:10:09         at org.gradle.tooling.internal.provider.StartParamsValidatingActionExecuter.execute(StartParamsValidatingActionExecuter.java:64)
14-Jan-2019 01:10:09         at org.gradle.tooling.internal.provider.StartParamsValidatingActionExecuter.execute(StartParamsValidatingActionExecuter.java:29)
14-Jan-2019 01:10:09         at org.gradle.tooling.internal.provider.SessionFailureReportingActionExecuter.execute(SessionFailureReportingActionExecuter.java:59)
14-Jan-2019 01:10:09         at org.gradle.tooling.internal.provider.SessionFailureReportingActionExecuter.execute(SessionFailureReportingActionExecuter.java:44)
14-Jan-2019 01:10:09         at org.gradle.tooling.internal.provider.SetupLoggingActionExecuter.execute(SetupLoggingActionExecuter.java:46)
14-Jan-2019 01:10:09         at org.gradle.tooling.internal.provider.SetupLoggingActionExecuter.execute(SetupLoggingActionExecuter.java:30)
14-Jan-2019 01:10:09         at org.gradle.launcher.daemon.server.exec.ExecuteBuild.doBuild(ExecuteBuild.java:67)
14-Jan-2019 01:10:09         at org.gradle.launcher.daemon.server.exec.BuildCommandOnly.execute(BuildCommandOnly.java:36)
14-Jan-2019 01:10:09         at org.gradle.launcher.daemon.server.api.DaemonCommandExecution.proceed(DaemonCommandExecution.java:122)
14-Jan-2019 01:10:09         at org.gradle.launcher.daemon.server.exec.WatchForDisconnection.execute(WatchForDisconnection.java:37)
14-Jan-2019 01:10:09         at org.gradle.launcher.daemon.server.api.DaemonCommandExecution.proceed(DaemonCommandExecution.java:122)
14-Jan-2019 01:10:09         at org.gradle.launcher.daemon.server.exec.ResetDeprecationLogger.execute(ResetDeprecationLogger.java:26)
14-Jan-2019 01:10:09         at org.gradle.launcher.daemon.server.api.DaemonCommandExecution.proceed(DaemonCommandExecution.java:122)
14-Jan-2019 01:10:09         at org.gradle.launcher.daemon.server.exec.RequestStopIfSingleUsedDaemon.execute(RequestStopIfSingleUsedDaemon.java:34)
14-Jan-2019 01:10:09         at org.gradle.launcher.daemon.server.api.DaemonCommandExecution.proceed(DaemonCommandExecution.java:122)
14-Jan-2019 01:10:09         at org.gradle.launcher.daemon.server.exec.ForwardClientInput$2.call(ForwardClientInput.java:74)
14-Jan-2019 01:10:09         at org.gradle.launcher.daemon.server.exec.ForwardClientInput$2.call(ForwardClientInput.java:72)
14-Jan-2019 01:10:09         at org.gradle.util.Swapper.swap(Swapper.java:38)
14-Jan-2019 01:10:09         at org.gradle.launcher.daemon.server.exec.ForwardClientInput.execute(ForwardClientInput.java:72)
14-Jan-2019 01:10:09         at org.gradle.launcher.daemon.server.api.DaemonCommandExecution.proceed(DaemonCommandExecution.java:122)
14-Jan-2019 01:10:09         at org.gradle.launcher.daemon.server.exec.LogAndCheckHealth.execute(LogAndCheckHealth.java:55)
14-Jan-2019 01:10:09         at org.gradle.launcher.daemon.server.api.DaemonCommandExecution.proceed(DaemonCommandExecution.java:122)
14-Jan-2019 01:10:09         at org.gradle.launcher.daemon.server.exec.LogToClient.doBuild(LogToClient.java:62)
14-Jan-2019 01:10:09         at org.gradle.launcher.daemon.server.exec.BuildCommandOnly.execute(BuildCommandOnly.java:36)
14-Jan-2019 01:10:09         at org.gradle.launcher.daemon.server.api.DaemonCommandExecution.proceed(DaemonCommandExecution.java:122)
14-Jan-2019 01:10:09         at org.gradle.launcher.daemon.server.exec.EstablishBuildEnvironment.doBuild(EstablishBuildEnvironment.java:82)
14-Jan-2019 01:10:09         at org.gradle.launcher.daemon.server.exec.BuildCommandOnly.execute(BuildCommandOnly.java:36)
14-Jan-2019 01:10:09         at org.gradle.launcher.daemon.server.api.DaemonCommandExecution.proceed(DaemonCommandExecution.java:122)
14-Jan-2019 01:10:09         at org.gradle.launcher.daemon.server.exec.StartBuildOrRespondWithBusy$1.run(StartBuildOrRespondWithBusy.java:50)
14-Jan-2019 01:10:09         at org.gradle.launcher.daemon.server.DaemonStateCoordinator$1.run(DaemonStateCoordinator.java:295)
14-Jan-2019 01:10:09         at org.gradle.internal.concurrent.ExecutorPolicy$CatchAndRecordFailures.onExecute(ExecutorPolicy.java:63)
14-Jan-2019 01:10:09         at org.gradle.internal.concurrent.ManagedExecutorImpl$1.run(ManagedExecutorImpl.java:46)
14-Jan-2019 01:10:09         at org.gradle.internal.concurrent.ThreadFactoryImpl$ManagedThreadRunnable.run(ThreadFactoryImpl.java:55)
14-Jan-2019 01:10:09
14-Jan-2019 01:10:09
14-Jan-2019 01:10:09 * Get more help at https://help.gradle.org
14-Jan-2019 01:10:09
14-Jan-2019 01:10:09 BUILD FAILED in 3s
14-Jan-2019 01:10:09 Failing task since return code of [/bin/sh ./gradlew clean build sonarRunner --continue --stacktrace -Dsonar.jdbc.driverClassName=org.postgresql.Driver -Dsonar.jdbc.url=jdbc:postgresql://10.194.6.9/sonar -Dsonar.host.url=https://sonar.spring.io -Dsonar.jdbc.username=sonar -Dsonar.jdbc.password=********] was 1 while expected 0
14-Jan-2019 01:10:09 Finished task 'Execute Gradle Wrapper' with result: Failed
14-Jan-2019 01:10:09 Running post build plugin 'Docker Container Cleanup'
14-Jan-2019 01:10:09 Running post build plugin 'NCover Results Collector'
14-Jan-2019 01:10:09 Running post build plugin 'Artifactory Release Management Staging'
14-Jan-2019 01:10:09 Running post build plugin 'Artifactory Build Info Copier'
14-Jan-2019 01:10:09 Running post build plugin 'Artifactory Gradle Properties Info Copier'
14-Jan-2019 01:10:09 Running post build plugin 'Clover Results Collector'
14-Jan-2019 01:10:09 Running post build plugin 'npm Cache Cleanup'
14-Jan-2019 01:10:09 Running post build plugin 'Artifact Copier'
14-Jan-2019 01:10:09 Successfully removed working directory at '/opt/bamboo-home/xml-data/build-dir/INTEXT-ZIPSONAR-JOB1'
14-Jan-2019 01:10:09 Finalising the build...
14-Jan-2019 01:10:09 Stopping timer.
14-Jan-2019 01:10:09 Build INTEXT-ZIPSONAR-JOB1-1301 completed.
14-Jan-2019 01:10:09 Running on server: post build plugin 'NCover Results Collector'
14-Jan-2019 01:10:09 Running on server: post build plugin 'Build Hanging Detection Configuration'
14-Jan-2019 01:10:09 Running on server: post build plugin 'Clover Delta Calculator'
14-Jan-2019 01:10:09 Running on server: post build plugin 'Maven Dependencies Postprocessor'
14-Jan-2019 01:10:09 All post build plugins have finished
14-Jan-2019 01:10:09 Generating build results summary...
14-Jan-2019 01:10:09 Saving build results to disk...
14-Jan-2019 01:10:09 Logging substituted variables...
14-Jan-2019 01:10:09 Indexing build results...
14-Jan-2019 01:10:09 Finished building INTEXT-ZIPSONAR-JOB1-1301.