Build: #2022 failed

Job: Default Job failed

Stages & jobs

  1. Default Stage

Build log

The build generated 320 lines of output. Download or view full build log

04-Jan-2021 01:10:00 Build Spring Integration Extensions - Spring Integration Zip - Sonar - Default Job #2022 (INTEXT-ZIPSONAR-JOB1-2022) started building on agent bamboo-12.af.pivotal.io
04-Jan-2021 01:10:00 Remote agent on host bamboo-12.af.pivotal.io
04-Jan-2021 01:10:00 Build working directory is /opt/bamboo-home/xml-data/build-dir/INTEXT-ZIPSONAR-JOB1
04-Jan-2021 01:10:00 Executing build Spring Integration Extensions - Spring Integration Zip - Sonar - Default Job #2022 (INTEXT-ZIPSONAR-JOB1-2022)
04-Jan-2021 01:10:00 Starting task 'Checkout Default Repository' of type 'com.atlassian.bamboo.plugins.vcs:task.vcs.checkout'
04-Jan-2021 01:10:00 Checking out into /opt/bamboo-home/xml-data/build-dir/INTEXT-ZIPSONAR-JOB1
04-Jan-2021 01:10:00 Updating source code to revision: 8daf84e0747f5c1b0566902089cbed451e5930ed
04-Jan-2021 01:10:00 Creating local git repository in '/opt/bamboo-home/xml-data/build-dir/INTEXT-ZIPSONAR-JOB1/.git'.
04-Jan-2021 01:10:00 Initialized empty Git repository in /opt/bamboo-home/xml-data/build-dir/INTEXT-ZIPSONAR-JOB1/.git/
04-Jan-2021 01:10:00 Fetching 'refs/heads/master' from 'https://github.com/SpringSource/spring-integration-extensions.git'.
04-Jan-2021 01:10:02 From https://github.com/SpringSource/spring-integration-extensions
04-Jan-2021 01:10:02 * [new branch]      master     -> master
04-Jan-2021 01:10:02 * [new tag]         cass.v0.5.0.RELEASE  -> cass.v0.5.0.RELEASE
04-Jan-2021 01:10:02 * [new tag]         cass.v0.6.0.RELEASE  -> cass.v0.6.0.RELEASE
04-Jan-2021 01:10:02 * [new tag]         cass.v0.7.0.RELEASE  -> cass.v0.7.0.RELEASE
04-Jan-2021 01:10:02 * [new tag]         cass.v0.8.0.RELEASE  -> cass.v0.8.0.RELEASE
04-Jan-2021 01:10:02 * [new tag]         cass.v0.9.0          -> cass.v0.9.0
04-Jan-2021 01:10:02 * [new tag]         hz.v1.0.0-M1         -> hz.v1.0.0-M1
04-Jan-2021 01:10:02 * [new tag]         hz.v1.0.0.M2         -> hz.v1.0.0.M2
04-Jan-2021 01:10:02 * [new tag]         hz.v1.0.0.RELEASE    -> hz.v1.0.0.RELEASE
04-Jan-2021 01:10:02 * [new tag]         hz.v2.0.0.RELEASE    -> hz.v2.0.0.RELEASE
04-Jan-2021 01:10:02 * [new tag]         hz.v3.0.0            -> hz.v3.0.0
04-Jan-2021 01:10:02 * [new tag]         kafka.v1.0.0.M1      -> kafka.v1.0.0.M1
04-Jan-2021 01:10:02 * [new tag]         kafka.v1.0.0.M2      -> kafka.v1.0.0.M2
04-Jan-2021 01:10:02 * [new tag]         kafka.v1.0.0a.M2     -> kafka.v1.0.0a.M2
04-Jan-2021 01:10:02 * [new tag]         kdsl.v0.0.1.RELEASE  -> kdsl.v0.0.1.RELEASE
04-Jan-2021 01:10:02 * [new tag]         kdsl.v0.0.2.RELEASE  -> kdsl.v0.0.2.RELEASE
04-Jan-2021 01:10:02 * [new tag]         mqtt.v1.0.0.M1       -> mqtt.v1.0.0.M1
04-Jan-2021 01:10:02 * [new tag]         sidsl.v1.0.0.M1      -> sidsl.v1.0.0.M1
04-Jan-2021 01:10:02 * [new tag]         sidsl.v1.0.0.M2      -> sidsl.v1.0.0.M2
04-Jan-2021 01:10:02 * [new tag]         sidsl.v1.0.0.M3      -> sidsl.v1.0.0.M3
04-Jan-2021 01:10:02 * [new tag]         sidsl.v1.0.0.RC1     -> sidsl.v1.0.0.RC1
04-Jan-2021 01:10:02 * [new tag]         sitw.v1.0.0.M1       -> sitw.v1.0.0.M1
04-Jan-2021 01:10:02 * [new tag]         sitw.v1.0.0.RELEASE  -> sitw.v1.0.0.RELEASE
04-Jan-2021 01:10:02 * [new tag]         smb.v0.5.0.RELEASE   -> smb.v0.5.0.RELEASE
04-Jan-2021 01:10:02 * [new tag]         smb.v1.0.0.RELEASE   -> smb.v1.0.0.RELEASE
04-Jan-2021 01:10:02 * [new tag]         smb.v1.1.0.RELEASE   -> smb.v1.1.0.RELEASE
04-Jan-2021 01:10:02 * [new tag]         smb.v1.2.0.RELEASE   -> smb.v1.2.0.RELEASE
04-Jan-2021 01:10:02 * [new tag]         smb.v1.2.1.RELEASE   -> smb.v1.2.1.RELEASE
04-Jan-2021 01:10:02 * [new tag]         smpp.v1.0.0.GA       -> smpp.v1.0.0.GA
04-Jan-2021 01:10:02 * [new tag]         smpp.v1.0.0.RELEASE  -> smpp.v1.0.0.RELEASE
04-Jan-2021 01:10:02 * [new tag]         splunk.v1.0.0.M1-fix -> splunk.v1.0.0.M1-fix
04-Jan-2021 01:10:02 * [new tag]         zip.v1.0.0.M1        -> zip.v1.0.0.M1
04-Jan-2021 01:10:02 * [new tag]         zip.v1.0.0.RELEASE   -> zip.v1.0.0.RELEASE
04-Jan-2021 01:10:02 * [new tag]         zip.v1.0.1.RELEASE   -> zip.v1.0.1.RELEASE
04-Jan-2021 01:10:02 * [new tag]         zip.v1.0.2.RELEASE   -> zip.v1.0.2.RELEASE
04-Jan-2021 01:10:02 * [new tag]         zip.v1.0.3.RELEASE   -> zip.v1.0.3.RELEASE
04-Jan-2021 01:10:02 Checking out revision 8daf84e0747f5c1b0566902089cbed451e5930ed.
04-Jan-2021 01:10:02 Already on 'master'
04-Jan-2021 01:10:02 Updated source code to revision: 8daf84e0747f5c1b0566902089cbed451e5930ed
04-Jan-2021 01:10:02 Finished task 'Checkout Default Repository' with result: Success
04-Jan-2021 01:10:02 Running pre-build action: Artifactory Release Staging
04-Jan-2021 01:10:02 Running pre-build action: VCS Version Collector
04-Jan-2021 01:10:02
Substituting password variable: ${bamboo.sonar.password}
04-Jan-2021 01:10:02 Starting task 'Execute Gradle Wrapper' of type 'com.atlassian.bamboo.plugins.scripttask:task.builder.script'
04-Jan-2021 01:10:02
Beginning to execute external process for build 'Spring Integration Extensions - Spring Integration Zip - Sonar - Default Job #2022 (INTEXT-ZIPSONAR-JOB1-2022)'
... running command line:
/bin/sh ./gradlew clean build sonarRunner --continue --stacktrace -Dsonar.jdbc.driverClassName=org.postgresql.Driver -Dsonar.jdbc.url=jdbc:postgresql://10.194.6.9/sonar -Dsonar.host.url=https://sonar.spring.io -Dsonar.jdbc.username=sonar -Dsonar.jdbc.password=********
... in: /opt/bamboo-home/xml-data/build-dir/INTEXT-ZIPSONAR-JOB1/spring-integration-zip
... using extra environment variables:
bamboo_planRepository_1_branch=master
bamboo_********_username_password=********
bamboo_signing_store_password=********
bamboo_planRepository_2_branch=INTEXT-40
bamboo_capability_system_builder_ant_Ant_1_9=/opt/ant-1.9
bamboo_capability_system_builder_ant_Ant_1_8=/opt/ant-1.8
bamboo_planRepository_1_branchDisplayName=master
bamboo_artifactory_override_resolve_repo=libs-milestone
bamboo_capability_system_builder_node_Node_js_10_16=/opt/node-10.16/bin/node
bamboo_repository_revision_number=c07a7069293e7c83f69ba2f23735d8ae9f5c52f6
bamboo_repository_177209392_git_repositoryUrl=https://github.com/ghillert/spring-integration-extensions.git
bamboo_buildKey=INTEXT-ZIPSONAR-JOB1
bamboo_ge_cache_username=ci
bamboo_bintray_password=********
bamboo_repository_177209391_git_branch=master
bamboo_gradle_enterprise_cache_user=ci
bamboo_sonar_token_password=********
bamboo_planRepository_2_branchDisplayName=INTEXT-40
bamboo_shortJobName=Default Job
bamboo_artifactory_override_resolver_password=********
bamboo_sonatype_token=RSJChaox
bamboo_capability_system_builder_gradle___gradlew=./gradlew
bamboo_buildResultsUrl=https://build.spring.io/browse/INTEXT-ZIPSONAR-JOB1-2022
bamboo_capability_system_builder_mvn3_Maven_3_3=/opt/maven-3.3
bamboo_capability_system_builder_mvn3_Maven_3_2=/opt/maven-3.2
bamboo_capability_system_builder_mvn3_Maven_3_1=/opt/maven-3.1
bamboo_planRepository_repositoryUrl=https://github.com/SpringSource/spring-integration-extensions.git
bamboo_repository_177209391_git_repositoryUrl=https://github.com/SpringSource/spring-integration-extensions.git
bamboo_capability_system_builder_mvn3_Maven_3_6=/opt/maven-3.6
bamboo_agentId=295960581
bamboo_capability_system_builder_mvn3_Maven_3_5=/opt/maven-3.5
bamboo_capability_system_builder_mvn3_Maven_3_0=/opt/maven-3.0
bamboo_planRepository_revision=8daf84e0747f5c1b0566902089cbed451e5930ed
bamboo_planRepository_previousRevision=8daf84e0747f5c1b0566902089cbed451e5930ed
bamboo_pcfonePassword=********
bamboo_capability_remote_build=true
bamboo_repository_branch_name=INTEXT-40
bamboo_repository_177209391_name=Spring Integration Extensions
bamboo_sonatype_token_password=********
bamboo_sonatype_user=springsource
bamboo_gradle_enterprise_cache_password=********
bamboo_scdf_acceptance_tests_password=********
bamboo_APPLE_AC_PASSWORD=********
bamboo_repository_177209392_git_branch=INTEXT-40
JAVA_HOME=/opt/jdk-8
bamboo_gradle_enterprise_secret_access_key=********
bamboo_planRepository_branch=master
bamboo_repository_177209392_name=GHILLERT - SI Extensions
bamboo_capability_system_jdk_JDK_15=/opt/jdk-15
bamboo_repository_177209391_previous_revision_number=8daf84e0747f5c1b0566902089cbed451e5930ed
bamboo_capability_system_jdk_JDK_13=/opt/jdk-13
bamboo_capability_system_jdk_JDK_14=/opt/jdk-14
bamboo_planRepository_1_type=gitv2
bamboo_planRepository_branchName=master
bamboo_capability_system_jdk_JDK_12=/opt/jdk-12
bamboo_capability_system_builder_gradlew_gradlew=./
bamboo_capability_system_builder_ant_Ant_1_10=/opt/ant-1.10
bamboo_repository_177209391_git_username=spring-buildmaster
bamboo_sonar_password=********
bamboo_hg_cache_directory=/opt/bamboo-home/xml-data/build-dir/_hg-repositories-cache
bamboo_planRepository_1_username=spring-buildmaster
bamboo_planRepository_type=gitv2
bamboo_git_cache_directory=/opt/bamboo-home/xml-data/build-dir/_git-repositories-cache
bamboo_planRepository_2_branchName=INTEXT-40
bamboo_artifactory_username=buildmaster
bamboo_tmp_directory=/opt/bamboo-home/temp
bamboo_planKey=INTEXT-ZIPSONAR
bamboo_planRepository_username=spring-buildmaster
bamboo_JDK8_HOME=/opt/jdk-8
bamboo_planRepository_1_branchName=master
bamboo_sonar_version=6.7.7
bamboo_sonar_jdbc_password=********
bamboo_bintray_api_key_password=********
bamboo_repository_177209392_previous_revision_number=c07a7069293e7c83f69ba2f23735d8ae9f5c52f6
bamboo_dockerhub_password=********
bamboo_capability_system_jdk_JDK_1_11=/opt/jdk-11
bamboo_resultsUrl=https://build.spring.io/browse/INTEXT-ZIPSONAR-JOB1-2022
bamboo_APPLE_AC_USERNAME_PASSWORD=********
bamboo_capability_system_jdk_JDK_1_10=/opt/jdk-10
bamboo_build_working_directory=/opt/bamboo-home/xml-data/build-dir/INTEXT-ZIPSONAR-JOB1
bamboo_planRepository_1_name=Spring Integration Extensions
bamboo_capability_system_os=ubuntu1804
bamboo_nexusPush_stagingProfile=buildmaster
bamboo_shortPlanName=Spring Integration Zip - Sonar
bamboo_planRepository_2_username=ghillert
bamboo_planRepository_name=Spring Integration Extensions
bamboo_pcfoneUsername=builds@springframework.org
bamboo_buildNumber=2022
bamboo_planName=Spring Integration Extensions - Spring Integration Zip - Sonar
bamboo_JDK7_HOME=/opt/jdk-7
bamboo_shortPlanKey=ZIPSONAR
bamboo_shortJobKey=JOB1
bamboo_artifactory_password=********
bamboo_planRepository_2_name=GHILLERT - SI Extensions
bamboo_buildTimeStamp=2021-01-04T01:10:00.217Z
bamboo_repository_previous_revision_number=c07a7069293e7c83f69ba2f23735d8ae9f5c52f6
bamboo_sonar_username=buildmaster
bamboo_pcfoneApi=https://api.run.pcfone.io
bamboo_********_password=********
bamboo_repository_git_branch=INTEXT-40
bamboo_buildResultKey=INTEXT-ZIPSONAR-JOB1-2022
bamboo_nexusPush_close=true
bamboo_artifactory_override_resolver_username=buildmaster
bamboo_buildPlanName=Spring Integration Extensions - Spring Integration Zip - Sonar - Default Job
bamboo_planRepository_1_revision=8daf84e0747f5c1b0566902089cbed451e5930ed
bamboo_repository_177209392_revision_number=c07a7069293e7c83f69ba2f23735d8ae9f5c52f6
bamboo_repository_name=GHILLERT - SI Extensions
bamboo_signing_key_password=********
bamboo_repository_177209391_revision_number=8daf84e0747f5c1b0566902089cbed451e5930ed
bamboo_planRepository_2_previousRevision=c07a7069293e7c83f69ba2f23735d8ae9f5c52f6
bamboo_capability_system_builder_groovy_Groovy_2_5=/opt/groovy-2.5
bamboo_buildFailed=false
bamboo_capability_system_docker_executable=/usr/bin/docker
bamboo_capability_system_jdk_OpenJDK_7=/opt/jdk-7
bamboo_capability_system_builder_groovy_Groovy_2_4=/opt/groovy-2.4
bamboo_artifactory_override_deployer_username=buildmaster
bamboo_capability_system_builder_command_Bash=/bin/bash
bamboo_agentWorkingDirectory=/opt/bamboo-home/xml-data/build-dir
bamboo_planRepository_2_revision=c07a7069293e7c83f69ba2f23735d8ae9f5c52f6
bamboo_capability_system_git_executable=/usr/bin/git
bamboo_repository_git_username=ghillert
bamboo_planRepository_1_previousRevision=8daf84e0747f5c1b0566902089cbed451e5930ed
bamboo_capability_os_family=unix
bamboo_planRepository_branchDisplayName=master
bamboo_capability_system_builder_maven_Artifactory_Maven_3_6=/opt/maven-3.6
bamboo_capability_system_builder_maven_Artifactory_Maven_3_5=/opt/maven-3.5
bamboo_capability_system_builder_maven_Artifactory_Maven_3_3=/opt/maven-3.3
bamboo_planRepository_2_type=gh2
bamboo_capability_system_builder_maven_Artifactory_Maven_3_2=/opt/maven-3.2
bamboo_s3_properties=/home/bamboo/tools/s3.properties
bamboo_capability_system_builder_maven_Artifactory_Maven_3_1=/opt/maven-3.1
bamboo_artifactory_override_deploy_repo=libs-snapshot-local
bamboo_capability_system_builder_maven_Artifactory_Maven_3_0=/opt/maven-3.0
bamboo_plan_storageTag=INTEXT-ZIPSONAR
bamboo_repository_177209392_git_username=ghillert
bamboo_bintray_username_password=********
bamboo_planRepository_2_repositoryUrl=https://github.com/ghillert/spring-integration-extensions.git
bamboo_repository_177209391_branch_name=master
bamboo_repository_git_repositoryUrl=https://github.com/ghillert/spring-integration-extensions.git
bamboo_repository_177209392_branch_name=INTEXT-40
bamboo_working_directory=/opt/bamboo-home/xml-data/build-dir/INTEXT-ZIPSONAR-JOB1
bamboo_planRepository_1_repositoryUrl=https://github.com/SpringSource/spring-integration-extensions.git
bamboo_capability_system_jdk_JDK_1_8=/opt/jdk-8
bamboo_artifactory_override_deployer_password=********
bamboo_capability_system_jdk_JDK_1_9=/opt/jdk-9
bamboo_dockerhub_username_password=********
bamboo_sonatype_password=********
bamboo_capability_system_jdk_JDK_1_7=/opt/jdk-7
bamboo_sonar_ip=10.194.6.9
bamboo_ge_cache_password=********
04-Jan-2021 01:10:03 Starting a Gradle Daemon (subsequent builds will be faster)
04-Jan-2021 01:10:37
04-Jan-2021 01:10:37 FAILURE: Build failed with an exception.
04-Jan-2021 01:10:37
04-Jan-2021 01:10:37 * What went wrong:
04-Jan-2021 01:10:37 A problem occurred configuring root project 'spring-integration-zip'.
04-Jan-2021 01:10:37 > Could not resolve all artifacts for configuration ':classpath'.
04-Jan-2021 01:10:37    > Could not resolve org.sonarsource.scanner.gradle:sonarqube-gradle-plugin:2.8.
04-Jan-2021 01:10:37      Required by:
04-Jan-2021 01:10:37          project : > org.sonarqube:org.sonarqube.gradle.plugin:2.8
04-Jan-2021 01:10:37       > Could not resolve org.sonarsource.scanner.gradle:sonarqube-gradle-plugin:2.8.
04-Jan-2021 01:10:37          > Could not get resource 'https://repo.spring.io/plugins-release/org/sonarsource/scanner/gradle/sonarqube-gradle-plugin/2.8/sonarqube-gradle-plugin-2.8.pom'.
04-Jan-2021 01:10:37             > Could not HEAD 'https://repo.spring.io/plugins-release/org/sonarsource/scanner/gradle/sonarqube-gradle-plugin/2.8/sonarqube-gradle-plugin-2.8.pom'.
04-Jan-2021 01:10:37                > Read timed out
04-Jan-2021 01:10:37
04-Jan-2021 01:10:37 * Try:
04-Jan-2021 01:10:37 Run with --info or --debug option to get more log output. Run with --scan to get full insights.
04-Jan-2021 01:10:37
04-Jan-2021 01:10:37 * Exception is:
04-Jan-2021 01:10:37 org.gradle.api.ProjectConfigurationException: A problem occurred configuring root project 'spring-integration-zip'.
04-Jan-2021 01:10:37         at org.gradle.configuration.project.LifecycleProjectEvaluator.wrapException(LifecycleProjectEvaluator.java:79)
04-Jan-2021 01:10:37         at org.gradle.configuration.project.LifecycleProjectEvaluator.addConfigurationFailure(LifecycleProjectEvaluator.java:73)
04-Jan-2021 01:10:37         at org.gradle.configuration.project.LifecycleProjectEvaluator.access$400(LifecycleProjectEvaluator.java:54)
04-Jan-2021 01:10:37         at org.gradle.configuration.project.LifecycleProjectEvaluator$EvaluateProject.run(LifecycleProjectEvaluator.java:107)
04-Jan-2021 01:10:37         at org.gradle.internal.operations.DefaultBuildOperationExecutor$RunnableBuildOperationWorker.execute(DefaultBuildOperationExecutor.java:300)
04-Jan-2021 01:10:37         at org.gradle.internal.operations.DefaultBuildOperationExecutor$RunnableBuildOperationWorker.execute(DefaultBuildOperationExecutor.java:292)
04-Jan-2021 01:10:37         at org.gradle.internal.operations.DefaultBuildOperationExecutor.execute(DefaultBuildOperationExecutor.java:174)
04-Jan-2021 01:10:37         at org.gradle.internal.operations.DefaultBuildOperationExecutor.run(DefaultBuildOperationExecutor.java:90)
04-Jan-2021 01:10:37         at org.gradle.internal.operations.DelegatingBuildOperationExecutor.run(DelegatingBuildOperationExecutor.java:31)
04-Jan-2021 01:10:37         at org.gradle.configuration.project.LifecycleProjectEvaluator.evaluate(LifecycleProjectEvaluator.java:68)
04-Jan-2021 01:10:37         at org.gradle.api.internal.project.DefaultProject.evaluate(DefaultProject.java:687)
04-Jan-2021 01:10:37         at org.gradle.api.internal.project.DefaultProject.evaluate(DefaultProject.java:140)
04-Jan-2021 01:10:37         at org.gradle.execution.TaskPathProjectEvaluator.configure(TaskPathProjectEvaluator.java:35)
04-Jan-2021 01:10:37         at org.gradle.execution.TaskPathProjectEvaluator.configureHierarchy(TaskPathProjectEvaluator.java:60)
04-Jan-2021 01:10:37         at org.gradle.configuration.DefaultBuildConfigurer.configure(DefaultBuildConfigurer.java:41)
04-Jan-2021 01:10:37         at org.gradle.initialization.DefaultGradleLauncher$ConfigureBuild.run(DefaultGradleLauncher.java:274)
04-Jan-2021 01:10:37         at org.gradle.internal.operations.DefaultBuildOperationExecutor$RunnableBuildOperationWorker.execute(DefaultBuildOperationExecutor.java:300)
04-Jan-2021 01:10:37         at org.gradle.internal.operations.DefaultBuildOperationExecutor$RunnableBuildOperationWorker.execute(DefaultBuildOperationExecutor.java:292)
04-Jan-2021 01:10:37         at org.gradle.internal.operations.DefaultBuildOperationExecutor.execute(DefaultBuildOperationExecutor.java:174)
04-Jan-2021 01:10:37         at org.gradle.internal.operations.DefaultBuildOperationExecutor.run(DefaultBuildOperationExecutor.java:90)
04-Jan-2021 01:10:37         at org.gradle.internal.operations.DelegatingBuildOperationExecutor.run(DelegatingBuildOperationExecutor.java:31)
04-Jan-2021 01:10:37         at org.gradle.initialization.DefaultGradleLauncher.configureBuild(DefaultGradleLauncher.java:182)
04-Jan-2021 01:10:37         at org.gradle.initialization.DefaultGradleLauncher.doBuildStages(DefaultGradleLauncher.java:141)
04-Jan-2021 01:10:37         at org.gradle.initialization.DefaultGradleLauncher.executeTasks(DefaultGradleLauncher.java:124)
04-Jan-2021 01:10:37         at org.gradle.internal.invocation.GradleBuildController$1.call(GradleBuildController.java:77)
04-Jan-2021 01:10:37         at org.gradle.internal.invocation.GradleBuildController$1.call(GradleBuildController.java:74)
04-Jan-2021 01:10:37         at org.gradle.internal.work.DefaultWorkerLeaseService.withLocks(DefaultWorkerLeaseService.java:154)
04-Jan-2021 01:10:37         at org.gradle.internal.work.StopShieldingWorkerLeaseService.withLocks(StopShieldingWorkerLeaseService.java:38)
04-Jan-2021 01:10:37         at org.gradle.internal.invocation.GradleBuildController.doBuild(GradleBuildController.java:96)
04-Jan-2021 01:10:37         at org.gradle.internal.invocation.GradleBuildController.run(GradleBuildController.java:74)
04-Jan-2021 01:10:37         at org.gradle.tooling.internal.provider.ExecuteBuildActionRunner.run(ExecuteBuildActionRunner.java:28)
04-Jan-2021 01:10:37         at org.gradle.launcher.exec.ChainingBuildActionRunner.run(ChainingBuildActionRunner.java:35)
04-Jan-2021 01:10:37         at org.gradle.tooling.internal.provider.ValidatingBuildActionRunner.run(ValidatingBuildActionRunner.java:32)
04-Jan-2021 01:10:37         at org.gradle.launcher.exec.RunAsBuildOperationBuildActionRunner$3.run(RunAsBuildOperationBuildActionRunner.java:50)
04-Jan-2021 01:10:37         at org.gradle.internal.operations.DefaultBuildOperationExecutor$RunnableBuildOperationWorker.execute(DefaultBuildOperationExecutor.java:300)
04-Jan-2021 01:10:37         at org.gradle.internal.operations.DefaultBuildOperationExecutor$RunnableBuildOperationWorker.execute(DefaultBuildOperationExecutor.java:292)
04-Jan-2021 01:10:37         at org.gradle.internal.operations.DefaultBuildOperationExecutor.execute(DefaultBuildOperationExecutor.java:174)
04-Jan-2021 01:10:37         at org.gradle.internal.operations.DefaultBuildOperationExecutor.run(DefaultBuildOperationExecutor.java:90)
04-Jan-2021 01:10:37         at org.gradle.internal.operations.DelegatingBuildOperationExecutor.run(DelegatingBuildOperationExecutor.java:31)
04-Jan-2021 01:10:37         at org.gradle.launcher.exec.RunAsBuildOperationBuildActionRunner.run(RunAsBuildOperationBuildActionRunner.java:45)
04-Jan-2021 01:10:37         at org.gradle.tooling.internal.provider.SubscribableBuildActionRunner.run(SubscribableBuildActionRunner.java:51)
04-Jan-2021 01:10:37         at org.gradle.launcher.exec.InProcessBuildActionExecuter$1.transform(InProcessBuildActionExecuter.java:47)
04-Jan-2021 01:10:37         at org.gradle.launcher.exec.InProcessBuildActionExecuter$1.transform(InProcessBuildActionExecuter.java:44)
04-Jan-2021 01:10:37         at org.gradle.composite.internal.DefaultRootBuildState.run(DefaultRootBuildState.java:79)
04-Jan-2021 01:10:37         at org.gradle.launcher.exec.InProcessBuildActionExecuter.execute(InProcessBuildActionExecuter.java:44)
04-Jan-2021 01:10:37         at org.gradle.launcher.exec.InProcessBuildActionExecuter.execute(InProcessBuildActionExecuter.java:30)
04-Jan-2021 01:10:37         at org.gradle.launcher.exec.BuildTreeScopeBuildActionExecuter.execute(BuildTreeScopeBuildActionExecuter.java:39)
04-Jan-2021 01:10:37         at org.gradle.launcher.exec.BuildTreeScopeBuildActionExecuter.execute(BuildTreeScopeBuildActionExecuter.java:25)
04-Jan-2021 01:10:37         at org.gradle.tooling.internal.provider.ContinuousBuildActionExecuter.execute(ContinuousBuildActionExecuter.java:80)
04-Jan-2021 01:10:37         at org.gradle.tooling.internal.provider.ContinuousBuildActionExecuter.execute(ContinuousBuildActionExecuter.java:53)
04-Jan-2021 01:10:37         at org.gradle.tooling.internal.provider.ServicesSetupBuildActionExecuter.execute(ServicesSetupBuildActionExecuter.java:62)
04-Jan-2021 01:10:37         at org.gradle.tooling.internal.provider.ServicesSetupBuildActionExecuter.execute(ServicesSetupBuildActionExecuter.java:34)
04-Jan-2021 01:10:37         at org.gradle.tooling.internal.provider.GradleThreadBuildActionExecuter.execute(GradleThreadBuildActionExecuter.java:36)
04-Jan-2021 01:10:37         at org.gradle.tooling.internal.provider.GradleThreadBuildActionExecuter.execute(GradleThreadBuildActionExecuter.java:25)
04-Jan-2021 01:10:37         at org.gradle.tooling.internal.provider.ParallelismConfigurationBuildActionExecuter.execute(ParallelismConfigurationBuildActionExecuter.java:43)
04-Jan-2021 01:10:37         at org.gradle.tooling.internal.provider.ParallelismConfigurationBuildActionExecuter.execute(ParallelismConfigurationBuildActionExecuter.java:29)
04-Jan-2021 01:10:37         at org.gradle.tooling.internal.provider.StartParamsValidatingActionExecuter.execute(StartParamsValidatingActionExecuter.java:59)
04-Jan-2021 01:10:37         at org.gradle.tooling.internal.provider.StartParamsValidatingActionExecuter.execute(StartParamsValidatingActionExecuter.java:31)
04-Jan-2021 01:10:37         at org.gradle.tooling.internal.provider.SessionFailureReportingActionExecuter.execute(SessionFailureReportingActionExecuter.java:59)
04-Jan-2021 01:10:37         at org.gradle.tooling.internal.provider.SessionFailureReportingActionExecuter.execute(SessionFailureReportingActionExecuter.java:44)
04-Jan-2021 01:10:37         at org.gradle.tooling.internal.provider.SetupLoggingActionExecuter.execute(SetupLoggingActionExecuter.java:46)
04-Jan-2021 01:10:37         at org.gradle.tooling.internal.provider.SetupLoggingActionExecuter.execute(SetupLoggingActionExecuter.java:30)
04-Jan-2021 01:10:37         at org.gradle.launcher.daemon.server.exec.ExecuteBuild.doBuild(ExecuteBuild.java:67)
04-Jan-2021 01:10:37         at org.gradle.launcher.daemon.server.exec.BuildCommandOnly.execute(BuildCommandOnly.java:36)
04-Jan-2021 01:10:37         at org.gradle.launcher.daemon.server.api.DaemonCommandExecution.proceed(DaemonCommandExecution.java:122)
04-Jan-2021 01:10:37         at org.gradle.launcher.daemon.server.exec.WatchForDisconnection.execute(WatchForDisconnection.java:37)
04-Jan-2021 01:10:37         at org.gradle.launcher.daemon.server.api.DaemonCommandExecution.proceed(DaemonCommandExecution.java:122)
04-Jan-2021 01:10:37         at org.gradle.launcher.daemon.server.exec.ResetDeprecationLogger.execute(ResetDeprecationLogger.java:26)
04-Jan-2021 01:10:37         at org.gradle.launcher.daemon.server.api.DaemonCommandExecution.proceed(DaemonCommandExecution.java:122)
04-Jan-2021 01:10:37         at org.gradle.launcher.daemon.server.exec.RequestStopIfSingleUsedDaemon.execute(RequestStopIfSingleUsedDaemon.java:34)
04-Jan-2021 01:10:37         at org.gradle.launcher.daemon.server.api.DaemonCommandExecution.proceed(DaemonCommandExecution.java:122)
04-Jan-2021 01:10:37         at org.gradle.launcher.daemon.server.exec.ForwardClientInput$2.call(ForwardClientInput.java:74)
04-Jan-2021 01:10:37         at org.gradle.launcher.daemon.server.exec.ForwardClientInput$2.call(ForwardClientInput.java:72)
04-Jan-2021 01:10:37         at org.gradle.util.Swapper.swap(Swapper.java:38)
04-Jan-2021 01:10:37         at org.gradle.launcher.daemon.server.exec.ForwardClientInput.execute(ForwardClientInput.java:72)
04-Jan-2021 01:10:37         at org.gradle.launcher.daemon.server.api.DaemonCommandExecution.proceed(DaemonCommandExecution.java:122)
04-Jan-2021 01:10:37         at org.gradle.launcher.daemon.server.exec.LogAndCheckHealth.execute(LogAndCheckHealth.java:55)
04-Jan-2021 01:10:37         at org.gradle.launcher.daemon.server.api.DaemonCommandExecution.proceed(DaemonCommandExecution.java:122)
04-Jan-2021 01:10:37         at org.gradle.launcher.daemon.server.exec.LogToClient.doBuild(LogToClient.java:62)
04-Jan-2021 01:10:37         at org.gradle.launcher.daemon.server.exec.BuildCommandOnly.execute(BuildCommandOnly.java:36)
04-Jan-2021 01:10:37         at org.gradle.launcher.daemon.server.api.DaemonCommandExecution.proceed(DaemonCommandExecution.java:122)
04-Jan-2021 01:10:37         at org.gradle.launcher.daemon.server.exec.EstablishBuildEnvironment.doBuild(EstablishBuildEnvironment.java:81)
04-Jan-2021 01:10:37         at org.gradle.launcher.daemon.server.exec.BuildCommandOnly.execute(BuildCommandOnly.java:36)
04-Jan-2021 01:10:37         at org.gradle.launcher.daemon.server.api.DaemonCommandExecution.proceed(DaemonCommandExecution.java:122)
04-Jan-2021 01:10:37         at org.gradle.launcher.daemon.server.exec.StartBuildOrRespondWithBusy$1.run(StartBuildOrRespondWithBusy.java:50)
04-Jan-2021 01:10:37         at org.gradle.launcher.daemon.server.DaemonStateCoordinator$1.run(DaemonStateCoordinator.java:295)
04-Jan-2021 01:10:37         at org.gradle.internal.concurrent.ExecutorPolicy$CatchAndRecordFailures.onExecute(ExecutorPolicy.java:63)
04-Jan-2021 01:10:37         at org.gradle.internal.concurrent.ManagedExecutorImpl$1.run(ManagedExecutorImpl.java:46)
04-Jan-2021 01:10:37         at org.gradle.internal.concurrent.ThreadFactoryImpl$ManagedThreadRunnable.run(ThreadFactoryImpl.java:55)
04-Jan-2021 01:10:37 Caused by: org.gradle.api.internal.artifacts.ivyservice.DefaultLenientConfiguration$ArtifactResolveException: Could not resolve all artifacts for configuration ':classpath'.
04-Jan-2021 01:10:37         at org.gradle.api.internal.artifacts.configurations.DefaultConfiguration.rethrowFailure(DefaultConfiguration.java:1054)
04-Jan-2021 01:10:37         at org.gradle.api.internal.artifacts.configurations.DefaultConfiguration.access$1700(DefaultConfiguration.java:123)
04-Jan-2021 01:10:37         at org.gradle.api.internal.artifacts.configurations.DefaultConfiguration$ConfigurationArtifactCollection.ensureResolved(DefaultConfiguration.java:1489)
04-Jan-2021 01:10:37         at org.gradle.api.internal.artifacts.configurations.DefaultConfiguration$ConfigurationArtifactCollection.getArtifacts(DefaultConfiguration.java:1461)
04-Jan-2021 01:10:37         at org.gradle.composite.internal.CompositeBuildClassPathInitializer.execute(CompositeBuildClassPathInitializer.java:45)
04-Jan-2021 01:10:37         at org.gradle.composite.internal.CompositeBuildClassPathInitializer.execute(CompositeBuildClassPathInitializer.java:32)
04-Jan-2021 01:10:37         at org.gradle.api.internal.initialization.DefaultScriptClassPathResolver.resolveClassPath(DefaultScriptClassPathResolver.java:37)
04-Jan-2021 01:10:37         at org.gradle.api.internal.initialization.DefaultScriptHandler.getScriptClassPath(DefaultScriptHandler.java:74)
04-Jan-2021 01:10:37         at org.gradle.plugin.use.internal.DefaultPluginRequestApplicator.defineScriptHandlerClassScope(DefaultPluginRequestApplicator.java:204)
04-Jan-2021 01:10:37         at org.gradle.plugin.use.internal.DefaultPluginRequestApplicator.applyPlugins(DefaultPluginRequestApplicator.java:140)
04-Jan-2021 01:10:37         at org.gradle.configuration.DefaultScriptPluginFactory$ScriptPluginImpl.apply(DefaultScriptPluginFactory.java:186)
04-Jan-2021 01:10:37         at org.gradle.configuration.BuildOperationScriptPlugin$1$1.run(BuildOperationScriptPlugin.java:69)
04-Jan-2021 01:10:37         at org.gradle.internal.operations.DefaultBuildOperationExecutor$RunnableBuildOperationWorker.execute(DefaultBuildOperationExecutor.java:300)
04-Jan-2021 01:10:37         at org.gradle.internal.operations.DefaultBuildOperationExecutor$RunnableBuildOperationWorker.execute(DefaultBuildOperationExecutor.java:292)
04-Jan-2021 01:10:37         at org.gradle.internal.operations.DefaultBuildOperationExecutor.execute(DefaultBuildOperationExecutor.java:174)
04-Jan-2021 01:10:37         at org.gradle.internal.operations.DefaultBuildOperationExecutor.run(DefaultBuildOperationExecutor.java:90)
04-Jan-2021 01:10:37         at org.gradle.internal.operations.DelegatingBuildOperationExecutor.run(DelegatingBuildOperationExecutor.java:31)
04-Jan-2021 01:10:37         at org.gradle.configuration.BuildOperationScriptPlugin$1.execute(BuildOperationScriptPlugin.java:66)
04-Jan-2021 01:10:37         at org.gradle.configuration.BuildOperationScriptPlugin$1.execute(BuildOperationScriptPlugin.java:63)
04-Jan-2021 01:10:37         at org.gradle.configuration.internal.DefaultUserCodeApplicationContext.apply(DefaultUserCodeApplicationContext.java:48)
04-Jan-2021 01:10:37         at org.gradle.configuration.BuildOperationScriptPlugin.apply(BuildOperationScriptPlugin.java:63)
04-Jan-2021 01:10:37         at org.gradle.configuration.project.BuildScriptProcessor.execute(BuildScriptProcessor.java:41)
04-Jan-2021 01:10:37         at org.gradle.configuration.project.BuildScriptProcessor.execute(BuildScriptProcessor.java:26)
04-Jan-2021 01:10:37         at org.gradle.configuration.project.ConfigureActionsProjectEvaluator.evaluate(ConfigureActionsProjectEvaluator.java:34)
04-Jan-2021 01:10:37         at org.gradle.configuration.project.LifecycleProjectEvaluator$EvaluateProject.run(LifecycleProjectEvaluator.java:105)
04-Jan-2021 01:10:37         ... 85 more
04-Jan-2021 01:10:37 Caused by: org.gradle.internal.resolve.ModuleVersionResolveException: Could not resolve org.sonarsource.scanner.gradle:sonarqube-gradle-plugin:2.8.
04-Jan-2021 01:10:37 Required by:
04-Jan-2021 01:10:37     project : > org.sonarqube:org.sonarqube.gradle.plugin:2.8
04-Jan-2021 01:10:37         at org.gradle.api.internal.artifacts.ivyservice.ivyresolve.RepositoryChainComponentMetaDataResolver.resolveModule(RepositoryChainComponentMetaDataResolver.java:103)
04-Jan-2021 01:10:37         at org.gradle.api.internal.artifacts.ivyservice.ivyresolve.RepositoryChainComponentMetaDataResolver.resolve(RepositoryChainComponentMetaDataResolver.java:63)
04-Jan-2021 01:10:37         at org.gradle.api.internal.artifacts.ivyservice.resolveengine.ComponentResolversChain$ComponentMetaDataResolverChain.resolve(ComponentResolversChain.java:94)
04-Jan-2021 01:10:37         at org.gradle.api.internal.artifacts.ivyservice.clientmodule.ClientModuleResolver.resolve(ClientModuleResolver.java:62)
04-Jan-2021 01:10:37         at org.gradle.api.internal.artifacts.ivyservice.resolveengine.graph.builder.ComponentState.resolve(ComponentState.java:208)
04-Jan-2021 01:10:37         at org.gradle.api.internal.artifacts.ivyservice.resolveengine.graph.builder.ComponentState.resolve(ComponentState.java:196)
04-Jan-2021 01:10:37         at org.gradle.api.internal.artifacts.ivyservice.resolveengine.graph.builder.ComponentState.getMetadata(ComponentState.java:152)
04-Jan-2021 01:10:37         at org.gradle.api.internal.artifacts.ivyservice.resolveengine.graph.builder.EdgeState.calculateTargetConfigurations(EdgeState.java:156)
04-Jan-2021 01:10:37         at org.gradle.api.internal.artifacts.ivyservice.resolveengine.graph.builder.EdgeState.attachToTargetConfigurations(EdgeState.java:112)
04-Jan-2021 01:10:37         at org.gradle.api.internal.artifacts.ivyservice.resolveengine.graph.builder.DependencyGraphBuilder.attachToTargetRevisionsSerially(DependencyGraphBuilder.java:315)
04-Jan-2021 01:10:37         at org.gradle.api.internal.artifacts.ivyservice.resolveengine.graph.builder.DependencyGraphBuilder.resolveEdges(DependencyGraphBuilder.java:202)
04-Jan-2021 01:10:37         at org.gradle.api.internal.artifacts.ivyservice.resolveengine.graph.builder.DependencyGraphBuilder.traverseGraph(DependencyGraphBuilder.java:155)
04-Jan-2021 01:10:37         at org.gradle.api.internal.artifacts.ivyservice.resolveengine.graph.builder.DependencyGraphBuilder.resolve(DependencyGraphBuilder.java:126)
04-Jan-2021 01:10:37         at org.gradle.api.internal.artifacts.ivyservice.resolveengine.DefaultArtifactDependencyResolver.resolve(DefaultArtifactDependencyResolver.java:123)
04-Jan-2021 01:10:37         at org.gradle.api.internal.artifacts.ivyservice.DefaultConfigurationResolver.resolveGraph(DefaultConfigurationResolver.java:167)
04-Jan-2021 01:10:37         at org.gradle.api.internal.artifacts.ivyservice.ShortCircuitEmptyConfigurationResolver.resolveGraph(ShortCircuitEmptyConfigurationResolver.java:89)
04-Jan-2021 01:10:37         at org.gradle.api.internal.artifacts.ivyservice.ErrorHandlingConfigurationResolver.resolveGraph(ErrorHandlingConfigurationResolver.java:73)
04-Jan-2021 01:10:37         at org.gradle.api.internal.artifacts.configurations.DefaultConfiguration$5.run(DefaultConfiguration.java:533)
04-Jan-2021 01:10:37         at org.gradle.internal.operations.DefaultBuildOperationExecutor$RunnableBuildOperationWorker.execute(DefaultBuildOperationExecutor.java:300)
04-Jan-2021 01:10:37         at org.gradle.internal.operations.DefaultBuildOperationExecutor$RunnableBuildOperationWorker.execute(DefaultBuildOperationExecutor.java:292)
04-Jan-2021 01:10:37         at org.gradle.internal.operations.DefaultBuildOperationExecutor.execute(DefaultBuildOperationExecutor.java:174)
04-Jan-2021 01:10:37         at org.gradle.internal.operations.DefaultBuildOperationExecutor.run(DefaultBuildOperationExecutor.java:90)
04-Jan-2021 01:10:37         at org.gradle.internal.operations.DelegatingBuildOperationExecutor.run(DelegatingBuildOperationExecutor.java:31)
04-Jan-2021 01:10:37         at org.gradle.api.internal.artifacts.configurations.DefaultConfiguration.resolveGraphIfRequired(DefaultConfiguration.java:524)
04-Jan-2021 01:10:37         at org.gradle.api.internal.artifacts.configurations.DefaultConfiguration.resolveToStateOrLater(DefaultConfiguration.java:509)
04-Jan-2021 01:10:37         at org.gradle.api.internal.artifacts.configurations.DefaultConfiguration.access$1800(DefaultConfiguration.java:123)
04-Jan-2021 01:10:37         at org.gradle.api.internal.artifacts.configurations.DefaultConfiguration$ConfigurationFileCollection.getSelectedArtifacts(DefaultConfiguration.java:1037)
04-Jan-2021 01:10:37         at org.gradle.api.internal.artifacts.configurations.DefaultConfiguration$ConfigurationFileCollection.access$3100(DefaultConfiguration.java:971)
04-Jan-2021 01:10:37         at org.gradle.api.internal.artifacts.configurations.DefaultConfiguration$ConfigurationArtifactCollection.ensureResolved(DefaultConfiguration.java:1483)
04-Jan-2021 01:10:37         ... 107 more
04-Jan-2021 01:10:37 Caused by: org.gradle.internal.resolve.ModuleVersionResolveException: Could not resolve org.sonarsource.scanner.gradle:sonarqube-gradle-plugin:2.8.
04-Jan-2021 01:10:37         at org.gradle.api.internal.artifacts.ivyservice.ivyresolve.ErrorHandlingModuleComponentRepository$ErrorHandlingModuleComponentRepositoryAccess.resolveComponentMetaData(ErrorHandlingModuleComponentRepository.java:141)
04-Jan-2021 01:10:37         at org.gradle.api.internal.artifacts.ivyservice.ivyresolve.ComponentMetaDataResolveState.process(ComponentMetaDataResolveState.java:75)
04-Jan-2021 01:10:37         at org.gradle.api.internal.artifacts.ivyservice.ivyresolve.ComponentMetaDataResolveState.resolve(ComponentMetaDataResolveState.java:63)
04-Jan-2021 01:10:37         at org.gradle.api.internal.artifacts.ivyservice.ivyresolve.RepositoryChainComponentMetaDataResolver.findBestMatch(RepositoryChainComponentMetaDataResolver.java:138)
04-Jan-2021 01:10:37         at org.gradle.api.internal.artifacts.ivyservice.ivyresolve.RepositoryChainComponentMetaDataResolver.findBestMatch(RepositoryChainComponentMetaDataResolver.java:119)
04-Jan-2021 01:10:37         at org.gradle.api.internal.artifacts.ivyservice.ivyresolve.RepositoryChainComponentMetaDataResolver.resolveModule(RepositoryChainComponentMetaDataResolver.java:92)
04-Jan-2021 01:10:37         ... 135 more
04-Jan-2021 01:10:37 Caused by: org.gradle.api.resources.ResourceException: Could not get resource 'https://repo.spring.io/plugins-release/org/sonarsource/scanner/gradle/sonarqube-gradle-plugin/2.8/sonarqube-gradle-plugin-2.8.pom'.
04-Jan-2021 01:10:37         at org.gradle.internal.resource.ResourceExceptions.failure(ResourceExceptions.java:74)
04-Jan-2021 01:10:37         at org.gradle.internal.resource.ResourceExceptions.getFailed(ResourceExceptions.java:57)
04-Jan-2021 01:10:37         at org.gradle.api.internal.artifacts.repositories.resolver.DefaultExternalResourceArtifactResolver.downloadByCoords(DefaultExternalResourceArtifactResolver.java:138)
04-Jan-2021 01:10:37         at org.gradle.api.internal.artifacts.repositories.resolver.DefaultExternalResourceArtifactResolver.downloadStaticResource(DefaultExternalResourceArtifactResolver.java:97)
04-Jan-2021 01:10:37         at org.gradle.api.internal.artifacts.repositories.resolver.DefaultExternalResourceArtifactResolver.resolveArtifact(DefaultExternalResourceArtifactResolver.java:64)
04-Jan-2021 01:10:37         at org.gradle.api.internal.artifacts.repositories.metadata.AbstractRepositoryMetadataSource.parseMetaDataFromArtifact(AbstractRepositoryMetadataSource.java:69)
04-Jan-2021 01:10:37         at org.gradle.api.internal.artifacts.repositories.metadata.AbstractRepositoryMetadataSource.create(AbstractRepositoryMetadataSource.java:59)
04-Jan-2021 01:10:37         at org.gradle.api.internal.artifacts.repositories.resolver.ExternalResourceResolver.resolveStaticDependency(ExternalResourceResolver.java:244)
04-Jan-2021 01:10:37         at org.gradle.api.internal.artifacts.repositories.resolver.MavenResolver.doResolveComponentMetaData(MavenResolver.java:127)
04-Jan-2021 01:10:37         at org.gradle.api.internal.artifacts.repositories.resolver.ExternalResourceResolver$RemoteRepositoryAccess.resolveComponentMetaData(ExternalResourceResolver.java:445)
04-Jan-2021 01:10:37         at org.gradle.api.internal.artifacts.ivyservice.ivyresolve.CachingModuleComponentRepository$ResolveAndCacheRepositoryAccess.resolveComponentMetaData(CachingModuleComponentRepository.java:378)
04-Jan-2021 01:10:37         at org.gradle.api.internal.artifacts.ivyservice.ivyresolve.ErrorHandlingModuleComponentRepository$ErrorHandlingModuleComponentRepositoryAccess.resolveComponentMetaData(ErrorHandlingModuleComponentRepository.java:138)
04-Jan-2021 01:10:37         ... 140 more
04-Jan-2021 01:10:37 Caused by: org.gradle.internal.resource.transport.http.HttpRequestException: Could not HEAD 'https://repo.spring.io/plugins-release/org/sonarsource/scanner/gradle/sonarqube-gradle-plugin/2.8/sonarqube-gradle-plugin-2.8.pom'.
04-Jan-2021 01:10:37         at org.gradle.internal.resource.transport.http.HttpClientHelper.performRequest(HttpClientHelper.java:96)
04-Jan-2021 01:10:37         at org.gradle.internal.resource.transport.http.HttpClientHelper.performRawHead(HttpClientHelper.java:72)
04-Jan-2021 01:10:37         at org.gradle.internal.resource.transport.http.HttpClientHelper.performHead(HttpClientHelper.java:76)
04-Jan-2021 01:10:37         at org.gradle.internal.resource.transport.http.HttpResourceAccessor.getMetaData(HttpResourceAccessor.java:65)
04-Jan-2021 01:10:37         at org.gradle.internal.resource.transfer.DefaultExternalResourceConnector.getMetaData(DefaultExternalResourceConnector.java:63)
04-Jan-2021 01:10:37         at org.gradle.internal.resource.transfer.AccessorBackedExternalResource.getMetaData(AccessorBackedExternalResource.java:201)
04-Jan-2021 01:10:37         at org.gradle.internal.resource.BuildOperationFiringExternalResourceDecorator$1.call(BuildOperationFiringExternalResourceDecorator.java:61)
04-Jan-2021 01:10:37         at org.gradle.internal.resource.BuildOperationFiringExternalResourceDecorator$1.call(BuildOperationFiringExternalResourceDecorator.java:58)
04-Jan-2021 01:10:37         at org.gradle.internal.operations.DefaultBuildOperationExecutor$CallableBuildOperationWorker.execute(DefaultBuildOperationExecutor.java:314)
04-Jan-2021 01:10:37         at org.gradle.internal.operations.DefaultBuildOperationExecutor$CallableBuildOperationWorker.execute(DefaultBuildOperationExecutor.java:304)
04-Jan-2021 01:10:37         at org.gradle.internal.operations.DefaultBuildOperationExecutor.execute(DefaultBuildOperationExecutor.java:174)
04-Jan-2021 01:10:37         at org.gradle.internal.operations.DefaultBuildOperationExecutor.call(DefaultBuildOperationExecutor.java:100)
04-Jan-2021 01:10:37         at org.gradle.internal.operations.DelegatingBuildOperationExecutor.call(DelegatingBuildOperationExecutor.java:36)
04-Jan-2021 01:10:37         at org.gradle.internal.resource.BuildOperationFiringExternalResourceDecorator.getMetaData(BuildOperationFiringExternalResourceDecorator.java:58)
04-Jan-2021 01:10:37         at org.gradle.internal.resource.transfer.DefaultCacheAwareExternalResourceAccessor$1.create(DefaultCacheAwareExternalResourceAccessor.java:101)
04-Jan-2021 01:10:37         at org.gradle.internal.resource.transfer.DefaultCacheAwareExternalResourceAccessor$1.create(DefaultCacheAwareExternalResourceAccessor.java:81)
04-Jan-2021 01:10:37         at org.gradle.cache.internal.ProducerGuard$AdaptiveProducerGuard.guardByKey(ProducerGuard.java:97)
04-Jan-2021 01:10:37         at org.gradle.internal.resource.transfer.DefaultCacheAwareExternalResourceAccessor.getResource(DefaultCacheAwareExternalResourceAccessor.java:81)
04-Jan-2021 01:10:37         at org.gradle.api.internal.artifacts.repositories.resolver.DefaultExternalResourceArtifactResolver.downloadByCoords(DefaultExternalResourceArtifactResolver.java:133)
04-Jan-2021 01:10:37         ... 149 more
04-Jan-2021 01:10:37 Caused by: java.net.SocketTimeoutException: Read timed out
04-Jan-2021 01:10:37         at org.apache.http.impl.io.SessionInputBufferImpl.streamRead(SessionInputBufferImpl.java:137)
04-Jan-2021 01:10:37         at org.apache.http.impl.io.SessionInputBufferImpl.fillBuffer(SessionInputBufferImpl.java:153)
04-Jan-2021 01:10:37         at org.apache.http.impl.io.SessionInputBufferImpl.readLine(SessionInputBufferImpl.java:282)
04-Jan-2021 01:10:37         at org.apache.http.impl.conn.DefaultHttpResponseParser.parseHead(DefaultHttpResponseParser.java:138)
04-Jan-2021 01:10:37         at org.apache.http.impl.conn.DefaultHttpResponseParser.parseHead(DefaultHttpResponseParser.java:56)
04-Jan-2021 01:10:37         at org.apache.http.impl.io.AbstractMessageParser.parse(AbstractMessageParser.java:259)
04-Jan-2021 01:10:37         at org.apache.http.impl.DefaultBHttpClientConnection.receiveResponseHeader(DefaultBHttpClientConnection.java:163)
04-Jan-2021 01:10:37         at org.apache.http.impl.conn.CPoolProxy.receiveResponseHeader(CPoolProxy.java:165)
04-Jan-2021 01:10:37         at org.apache.http.protocol.HttpRequestExecutor.doReceiveResponse(HttpRequestExecutor.java:273)
04-Jan-2021 01:10:37         at org.apache.http.protocol.HttpRequestExecutor.execute(HttpRequestExecutor.java:125)
04-Jan-2021 01:10:37         at org.apache.http.impl.execchain.MainClientExec.execute(MainClientExec.java:272)
04-Jan-2021 01:10:37         at org.apache.http.impl.execchain.ProtocolExec.execute(ProtocolExec.java:185)
04-Jan-2021 01:10:37         at org.apache.http.impl.execchain.RetryExec.execute(RetryExec.java:89)
04-Jan-2021 01:10:37         at org.apache.http.impl.execchain.RedirectExec.execute(RedirectExec.java:111)
04-Jan-2021 01:10:37         at org.apache.http.impl.client.InternalHttpClient.doExecute(InternalHttpClient.java:185)
04-Jan-2021 01:10:37         at org.apache.http.impl.client.CloseableHttpClient.execute(CloseableHttpClient.java:83)
04-Jan-2021 01:10:37         at org.gradle.internal.resource.transport.http.HttpClientHelper.performHttpRequest(HttpClientHelper.java:148)
04-Jan-2021 01:10:37         at org.gradle.internal.resource.transport.http.HttpClientHelper.performHttpRequest(HttpClientHelper.java:126)
04-Jan-2021 01:10:37         at org.gradle.internal.resource.transport.http.HttpClientHelper.executeGetOrHead(HttpClientHelper.java:103)
04-Jan-2021 01:10:37         at org.gradle.internal.resource.transport.http.HttpClientHelper.performRequest(HttpClientHelper.java:94)
04-Jan-2021 01:10:37         ... 167 more
04-Jan-2021 01:10:37
04-Jan-2021 01:10:37
04-Jan-2021 01:10:37 * Get more help at https://help.gradle.org
04-Jan-2021 01:10:37
04-Jan-2021 01:10:37 BUILD FAILED in 34s
04-Jan-2021 01:10:37 Failing task since return code of [/bin/sh ./gradlew clean build sonarRunner --continue --stacktrace -Dsonar.jdbc.driverClassName=org.postgresql.Driver -Dsonar.jdbc.url=jdbc:postgresql://10.194.6.9/sonar -Dsonar.host.url=https://sonar.spring.io -Dsonar.jdbc.username=sonar -Dsonar.jdbc.password=********] was 1 while expected 0
04-Jan-2021 01:10:37 Finished task 'Execute Gradle Wrapper' with result: Failed
04-Jan-2021 01:10:37 Running post build plugin 'Docker Container Cleanup'
04-Jan-2021 01:10:37 Running post build plugin 'NCover Results Collector'
04-Jan-2021 01:10:37 Running post build plugin 'Artifactory Release Management Staging'
04-Jan-2021 01:10:37 Running post build plugin 'Artifactory Build Info Copier'
04-Jan-2021 01:10:37 Running post build plugin 'Artifactory Gradle Properties Info Copier'
04-Jan-2021 01:10:37 Running post build plugin 'Clover Results Collector'
04-Jan-2021 01:10:37 Running post build plugin 'npm Cache Cleanup'
04-Jan-2021 01:10:37 Running post build plugin 'Artifact Copier'
04-Jan-2021 01:10:37 Successfully removed working directory at '/opt/bamboo-home/xml-data/build-dir/INTEXT-ZIPSONAR-JOB1'
04-Jan-2021 01:10:37 Finalising the build...
04-Jan-2021 01:10:37 Stopping timer.
04-Jan-2021 01:10:37 Build INTEXT-ZIPSONAR-JOB1-2022 completed.
04-Jan-2021 01:10:37 Running on server: post build plugin 'NCover Results Collector'
04-Jan-2021 01:10:37 Running on server: post build plugin 'Build Hanging Detection Configuration'
04-Jan-2021 01:10:37 Running on server: post build plugin 'Bamboo project link creator'
04-Jan-2021 01:10:37 Running on server: post build plugin 'Clover Delta Calculator'
04-Jan-2021 01:10:37 Running on server: post build plugin 'Maven Dependencies Postprocessor'
04-Jan-2021 01:10:37 All post build plugins have finished
04-Jan-2021 01:10:37 Generating build results summary...
04-Jan-2021 01:10:37 Saving build results to disk...
04-Jan-2021 01:10:38 Logging substituted variables...
04-Jan-2021 01:10:38 Indexing build results...
04-Jan-2021 01:10:38 Finished building INTEXT-ZIPSONAR-JOB1-2022.